program: Gaussian 09
title: 000182241
version: EM64L-G09RevD.01
frameworkgroup: C1[X(C11H21NO10S2)]
method: RPBEPBE
basis: SDD
operation: Freq
keyword: #p
keyword: freq=noraman
keyword: PBEPBE/SDD
title: #p freq=noraman PBEPBE/SDD
converged: YES YES NO NO
title: Mulliken charges:
elementType: S S O O O O O O O O O O N C C C C C C C C C C C H H H H H H H H H H H H H H H H H H H H H
charge: 0.073179 1.128823 -0.220565 -0.485952 -0.445978 -0.466721 -0.464372 -0.295120 -0.244186 -0.559070 -0.528862 -0.464222 -0.268884 -0.311474 -0.003268 -0.167023 -0.209734 -0.116923 -0.056657 -0.378277 -0.414365 0.371822 -0.363939 -0.690083 0.278498 0.202710 0.206033 0.229982 0.215160 0.235315 0.243017 0.249254 0.235921 0.149548 0.181316 0.224792 0.419011 0.372786 0.368579 0.222025 0.223104 0.208455 0.327332 0.367984 0.421029
chargesum: 0.00000
title: Mulliken charges with hydrogens summed into heavy atoms:
elementType: S S O O O O O O O O O O N C C C C C C C C C C C
charge: 0.222728 1.128823 -0.220565 -0.066941 -0.073192 -0.098142 -0.096387 -0.295120 -0.244186 -0.138041 -0.528862 -0.464222 0.058448 -0.311474 0.275230 0.035687 -0.003702 0.113058 0.158503 0.100055 0.070809 0.371822 0.042170 -0.036499
polarizability: 3.06512863e+02 -2.64820582e+01 2.10179535e+02 -4.77268682e+00 8.61147759e+00 1.82261746e+02
1716.lowfreq: -13.5150 -9.7047 -0.0028 -0.0025 -0.0016 4.4403 30.8152 35.3840 38.8306
frequency: 30.4958 35.2658 38.8230 39.9270 55.1323 69.4107 73.5943 82.2367 85.3766 105.7372 117.9772 126.7188 142.7814 160.7685 167.6548 176.9414 194.6668 204.1014 209.7506 214.5942 223.3931 232.0036 239.7471 254.4816 264.4952 271.0870 274.3773 288.4651 292.4254 305.7820 321.7436 324.8376 339.8536 362.4715 387.6489 414.3416 424.7445 433.1437 434.8530 458.7933 490.8011 520.5618 540.4485 557.6092 571.7775 581.9805 601.9668 620.8240 635.5111 654.6879 707.3492 727.6532 738.2213 762.7632 835.8369 838.6673 859.9208 886.2570 889.4194 920.2245 932.0685 949.0581 954.0611 964.4279 978.5903 983.2209 1008.3757 1013.2940 1033.4872 1049.4024 1055.8780 1063.9544 1078.7571 1080.9368 1091.4069 1116.4059 1119.5546 1129.2197 1143.3128 1150.5823 1195.7056 1204.5941 1221.6121 1246.0776 1255.7962 1256.4618 1284.4900 1291.8296 1295.7895 1299.3282 1309.3702 1312.9526 1323.1482 1330.0650 1344.2218 1352.3202 1354.9125 1364.6150 1383.5975 1394.5456 1411.1506 1412.6648 1461.1172 1472.3382 1472.6990 1477.6094 1486.6845 1567.1367 2398.4888 2776.7613 2920.3654 2946.5482 2957.1244 2960.8682 2974.0118 2979.6113 3006.4559 3011.9046 3014.6627 3022.8682 3070.3929 3078.3876 3081.9718 3105.9347 3396.7536 3433.8705 3484.2277 3551.8350 3601.0098
redmass: 7.7607 4.1500 8.6805 6.9748 4.8500 3.0640 2.3143 9.2514 5.7825 7.1309 4.0073 8.4154 3.6965 6.3367 5.5798 6.0441 4.5456 4.0477 1.6368 5.1155 4.3874 1.2013 3.6113 5.2797 2.1716 1.9758 4.8894 3.2864 6.4840 5.8722 9.5901 8.3073 7.6199 10.3943 6.1884 5.1936 2.3468 1.7198 6.0655 3.6719 3.7743 1.2857 3.3562 6.7606 8.0996 2.7842 4.7386 1.5925 1.1180 3.3744 2.1769 1.3297 1.8152 1.9725 1.8588 5.3598 1.7234 1.7496 2.4644 3.0295 2.5723 6.0697 6.4216 4.9575 4.0719 5.5256 3.4775 3.5891 3.3047 2.5995 1.7431 2.4462 3.3135 2.7456 3.0584 2.4303 2.1812 2.7202 3.0728 1.9813 1.4832 1.3627 1.4545 1.1785 1.2324 1.1797 1.1317 1.1789 1.3008 1.2364 1.2213 1.1326 1.1862 1.4424 1.5044 1.4725 1.3267 1.3522 1.5394 1.2069 1.3706 1.5271 1.0781 1.0647 1.0826 1.0430 1.0741 4.5883 1.0376 1.0802 1.0820 1.0818 1.0673 1.0742 1.0856 1.0360 1.0754 1.0833 1.0845 1.0611 1.1013 1.1014 1.1000 1.1062 1.0656 1.0789 1.0672 1.0657 1.0671
irintensity: 0.1646 0.9275 2.6118 2.3653 0.7607 1.8330 0.6458 2.2720 2.3543 2.3144 6.7285 20.4641 19.0380 15.8619 0.4499 7.1197 11.6188 27.5828 89.8304 18.2856 4.7362 0.1477 22.2681 7.1523 7.2368 21.7668 8.0745 11.6847 0.2178 4.9389 5.5136 8.8447 3.0504 31.6309 4.9721 7.8642 54.6529 72.7909 23.3966 17.3930 10.1992 121.4837 14.9073 11.2274 71.4541 67.2025 7.2665 3.2558 163.0252 4.3344 14.8003 72.3755 73.1160 11.4233 46.3225 98.9526 6.1182 10.4400 2.4123 8.9452 15.4785 164.0709 45.8735 9.3022 79.8887 190.9894 19.1955 152.4658 62.6245 8.9560 15.1084 4.4721 61.8576 26.7112 36.0272 28.0137 3.8423 15.8993 136.4349 69.4309 19.4237 19.9856 7.8434 24.4319 24.3970 19.4950 2.8675 2.2997 29.3398 0.7799 38.4501 84.9227 69.5451 12.8206 13.5930 25.0089 5.7384 7.2901 2.1213 11.8370 143.1520 9.7086 1.8789 3.2415 12.1225 12.5071 15.3134 31.9541 9.4244 246.4032 46.4105 14.3360 8.5433 39.0874 64.1613 33.6997 7.0141 14.5935 39.3269 25.8404 5.5438 50.1417 41.6603 17.2231 160.3505 14.9711 48.7365 30.8083 25.1340
temp: 298.150 k
press: 1.00000 atm
elementType: 16 16 8 8 8 8 8 8 8 8 8 8 7 6 6 6 6 6 6 6 6 6 6 6 1 1 1 1 1 1 1 1 1 1 1 1 1 1 1 1 1 1 1 1 1
symmnumber: 1
zpe: 874924.8 jmol-1
zpe.correction: 0.333241 hartree
zpe.thermalcorrener: 0.361594 hartree
zpe.thermalcorrenthalpy: 0.362538 hartree
zpe.thermalcorrgfe: 0.274381 hartree
zpe.sumelectzpe: -2032.693767 hartree
zpe.sumelectthermal: -2032.665414 hartree
zpe.sumelectthermalent: -2032.664470 hartree
zpe.sumelectthermalfe: -2032.752628 hartree
dipole: -9.9150 2.8546 -4.6080
dipole: 11.3000
quadrupole: -179.1077 -162.3298 -158.6676
quadrupole: 1.4689 9.9239 -4.4477
quadrupole: -12.4060 4.3719 8.0341 1.4689 9.9239 -4.4477
hfenergy: -2033.0270085 hartree
pointgroup: C01[X(C11H21N1O10S2)]
dipole: 3.9006638 -1.1650383 -1.7866707 debye
polarizability: 308.2900897|-23.0766914|206.8449451|4.8316728|-10.3090743|183.8191091 unknown
InChI: InChI=1S/C11H20NO7S.HO3S/c1-2-3-5(10(17)12-18)11(20)9(16)8(15)7(14)6(4-13)19-11;1-4(2)3/h5-9,12-16,20H,2-4H2,1H3;1H
charge 0 multiplicity 1
45 atoms
S  0.637967 -0.637036 2.830125
S  -4.390936 0.782308 -0.320891
O  2.347623 -0.114053 0.904236
O  -1.07841 1.287147 0.860835
O  0.406435 3.417694 -0.410036
O  2.845944 2.577299 -1.717751
O  5.153267 1.132677 -1.186064
O  -2.01814 -1.422602 1.008261
O  -3.26543 -0.768511 -1.363614
O  -4.341883 -0.087812 1.244929
O  -3.464228 2.117879 -0.303326
O  -5.929726 0.908102 -0.759281
N  -1.928045 -0.646506 -1.183913
C  0.880612 -0.072461 1.028948
C  0.367882 1.386222 0.859125
C  0.906133 2.045864 -0.421537
C  0.215156 -1.062431 -0.002604
C  2.436143 1.994263 -0.437844
C  2.922497 0.531709 -0.300235
C  0.704917 -2.528922 0.178888
C  4.444351 0.451495 -0.07639
C  -1.308975 -1.021722 0.030938
C  0.394274 -3.426981 -1.039808
C  0.931002 -4.861482 -0.847179
H  0.718062 1.978898 1.726729
H  0.536135 1.521321 -1.332446
H  0.539231 -0.725996 -1.011736
H  2.831577 2.590173 0.413597
H  2.64275 -0.027586 -1.220899
H  1.795256 -2.497362 0.362918
H  0.242198 -2.950858 1.089027
H  4.714981 1.000212 0.839852
H  4.768927 -0.599876 0.028133
H  -0.719329 -0.880802 2.662682
H  0.84181 -2.984992 -1.955149
H  -0.69945 -3.468171 -1.213784
H  -1.53453 2.107356 0.528021
H  0.840361 3.906565 -1.15657
H  3.834447 2.440168 -1.789906
H  0.703113 -5.496497 -1.721988
H  0.476957 -5.335694 0.042296
H  2.027803 -4.861068 -0.703624
H  -1.399979 -0.149702 -1.914688
H  5.404784 0.479628 -1.883741
H  -3.496039 -0.690954 1.226368
