program: Gaussian 09
title: 000182226
version: EM64L-G09RevD.01
frameworkgroup: C1[X(C17H33N)]
method: RPBEPBE
basis: SDD
operation: Freq
keyword: #pfreq=noraman
keyword: PBEPBE/SDD
title: #p freq=noraman PBEPBE/SDD
converged: YES YES NO NO
title: Mulliken charges:
elementType: N C C C C C C C C C C C C C C C C C H H H H H H H H H H H H H H H H H H H H H H H H H H H H H H H H H
charge: -0.047150 -0.145209 -0.426198 -0.437261 -0.378608 -0.387483 -0.430544 -0.389928 -0.484970 -0.385195 -0.385289 0.144549 -0.381607 -0.372869 -0.353180 -0.776711 -0.356772 -0.697036 0.210219 0.189864 0.203280 0.200529 0.210271 0.178060 0.236077 0.186504 0.194752 0.219804 0.209162 0.197070 0.192309 0.221202 0.223278 0.191497 0.193367 0.192455 0.193126 0.191431 0.191115 0.189066 0.189106 0.187243 0.187303 0.217717 0.220592 0.252325 0.194616 0.194646 0.209552 0.209457 0.214464
chargesum: 0.00000
title: Mulliken charges with hydrogens summed into heavy atoms:
elementType: N C C C C C C C C C C C C C C C C C
charge: -0.047150 0.065009 -0.033053 -0.026461 0.035528 -0.006227 -0.001577 -0.000548 -0.040490 -0.000331 0.000291 0.144549 0.000940 0.005304 0.021366 -0.086078 0.032491 -0.063562
polarizability: 2.51442184e+02 6.82302337e+00 1.75129412e+02 -2.59684725e+00 -5.02191391e-01 1.51933261e+02
1716.lowfreq: -19.5066 -10.6104 -6.2238 -0.0016 -0.0010 0.0014 7.1110 20.0073 26.0365
frequency: -13.6464 19.6164 24.8891 32.9396 52.9686 59.5572 68.0618 88.4734 97.6521 109.0404 129.0689 135.8059 137.6376 145.1157 147.6015 151.2208 190.8055 207.8852 228.1319 257.1225 281.6118 291.2157 343.6085 390.0290 406.8286 425.6628 446.5710 468.3736 489.0961 511.0615 555.8407 604.9508 718.1795 719.8913 724.1704 732.0275 745.5553 769.0867 804.2964 830.9708 838.8008 859.1407 887.0526 889.1760 913.5407 919.2198 967.0326 974.9021 981.4677 991.8170 1000.1678 1013.8512 1015.3849 1031.3122 1042.6035 1056.9102 1063.6453 1076.9237 1078.3285 1079.6540 1084.0904 1101.4920 1113.7241 1124.7124 1135.7084 1153.7672 1175.5316 1182.2314 1201.4591 1205.1659 1213.5793 1229.3305 1233.8579 1245.3363 1255.6362 1258.1803 1271.8238 1276.2842 1276.8179 1283.1471 1286.1556 1290.9115 1292.8021 1294.1113 1315.8016 1317.4451 1328.8029 1334.7156 1339.6909 1344.1675 1349.5730 1351.7029 1354.0127 1355.3987 1381.4501 1388.9621 1443.7007 1449.4087 1453.1959 1458.8287 1458.9743 1461.5481 1462.2817 1462.9766 1463.5080 1466.6817 1470.9751 1471.9247 1476.7608 1477.4578 1482.5155 1486.3445 1488.3995 1644.8034 2938.4641 2944.7465 2946.8121 2947.6508 2949.2373 2950.6927 2954.2371 2957.1571 2960.6834 2961.5286 2962.8362 2967.3284 2969.1740 2970.4787 2971.3818 2979.9209 2981.1423 2982.6977 2987.4245 2994.7512 3005.5163 3013.2040 3018.6541 3020.1309 3029.6347 3036.7621 3039.2834 3043.6464 3047.8205 3049.3174 3066.9794 3069.1619 3112.3217
redmass: 2.6164 3.4392 2.2849 3.2395 3.1736 1.6533 3.2729 2.8486 1.6134 2.8738 1.7602 2.2343 2.1245 1.5663 3.4359 2.0494 1.9729 2.9678 1.1102 1.9127 3.1971 3.6643 2.7166 2.8922 3.1091 2.8088 2.3893 2.9575 3.2297 3.3263 3.0288 2.4313 1.0590 1.0760 1.1626 1.4051 1.3983 1.2952 1.3031 2.2379 1.4671 1.4158 1.9007 1.8819 2.2869 1.3533 1.3657 2.4951 2.8127 2.0130 1.9586 1.5798 2.2083 1.5943 2.1470 2.5558 2.3858 2.2197 2.0337 2.2384 2.0180 2.0828 2.6766 2.5258 2.0254 1.4774 1.5328 1.8269 1.4666 1.5667 1.8239 1.3930 1.3598 1.3030 1.2731 1.2766 1.2636 1.1191 1.0839 1.0581 1.1237 1.1222 1.1155 1.2868 1.3040 1.3610 1.4337 1.4536 1.5619 1.6849 1.5703 1.7149 1.6675 1.6429 1.2772 1.2176 1.0848 1.0863 1.0714 1.0746 1.0741 1.0772 1.0611 1.0701 1.0641 1.0800 1.0902 1.0834 1.0426 1.0840 1.0888 1.0937 1.0936 7.4178 1.0816 1.0591 1.0586 1.0591 1.0593 1.0599 1.0620 1.0611 1.0596 1.0597 1.0610 1.0584 1.0425 1.0369 1.0609 1.0959 1.0637 1.0966 1.0983 1.1006 1.1021 1.0978 1.1046 1.0949 1.1047 1.0987 1.1041 1.0966 1.1025 1.1028 1.1007 1.0992 1.0981
irintensity: 0.1488 0.2489 0.2229 0.1544 0.8965 0.1668 0.1613 0.8234 0.0342 0.3016 0.1370 0.4094 0.3518 0.8479 0.0689 0.0411 1.1672 0.2099 0.0006 0.9746 0.8323 2.0765 1.5883 1.5375 0.6059 0.9668 0.5709 1.1882 0.9306 1.2294 3.2759 1.3307 18.1602 0.1390 5.1473 1.0746 0.2445 2.7201 3.2286 3.3814 2.4451 1.2294 7.7838 5.9383 8.1646 0.8881 0.7979 3.5651 3.1440 1.6062 0.1613 0.0391 0.9370 0.2465 0.5341 1.1018 1.5448 1.8449 0.7710 0.6362 1.3255 3.3551 9.6962 5.8369 1.1878 4.9482 11.7176 1.7354 7.5043 0.8894 12.5187 0.3894 2.7193 1.0639 2.9651 2.1437 0.1506 0.2307 0.3698 1.6178 0.4543 0.5877 0.1300 0.0263 12.4444 5.2773 4.9700 2.6017 4.9936 14.0030 0.8628 0.3716 0.7080 1.8583 33.6116 11.3977 10.0962 3.4343 19.2147 0.1061 0.3123 16.3362 6.3197 0.9768 0.6497 0.3987 10.7943 1.4333 12.2342 0.9290 1.6357 4.3080 37.4207 72.2081 13.8005 3.3057 0.7232 0.5001 0.2656 2.4999 4.1008 2.8053 10.6038 16.7064 128.3831 175.6471 62.0178 35.6478 59.4130 1.4715 32.6865 2.6963 3.0931 2.2184 3.5186 15.6525 2.9454 34.5175 0.2351 64.7361 117.7485 17.2505 99.7855 157.1941 100.1905 56.3131 17.0678
temp: 298.150 k
press: 1.00000 atm
elementType: 7 6 6 6 6 6 6 6 6 6 6 6 6 6 6 6 6 6 1 1 1 1 1 1 1 1 1 1 1 1 1 1 1 1 1 1 1 1 1 1 1 1 1 1 1 1 1 1 1 1 1
symmnumber: 1
zpe: 1220084.5 jmol-1
zpe.correction: 0.464706 hartree
zpe.thermalcorrener: 0.486544 hartree
zpe.thermalcorrenthalpy: 0.487488 hartree
zpe.thermalcorrgfe: 0.410976 hartree
zpe.sumelectzpe: -720.871990 hartree
zpe.sumelectthermal: -720.850152 hartree
zpe.sumelectthermalent: -720.849207 hartree
zpe.sumelectthermalfe: -720.925720 hartree
dipole: 2.1135 -0.6297 -0.2522
dipole: 2.2197
quadrupole: -98.8231 -113.6080 -115.6247
quadrupole: -0.8143 -1.9789 -1.9769
quadrupole: 10.5288 -4.2561 -6.2727 -0.8143 -1.9789 -1.9769
hfenergy: -721.3366957 hartree
pointgroup: C01 [X(C17H33N1)]
dipole: -0.8313644 0.2570279 -0.0736802 debye
polarizability: 251.4467056|6.4788905|174.7776103|3.3208318|2.8519844|152.2805408 unknown
InChI: InChI=1S/C17H33N/c1-3-4-5-6-7-8-9-10-11-14-17-15-12-13-16(2)18-17/h17H,3-15H2,1-2H3
charge 0 multiplicity 1
51 atoms
N  -4.384917 -0.786307 0.1279
C  -4.222016 0.672614 0.414833
C  -2.874468 1.132815 -0.19559
C  -5.404507 1.55542 -0.05263
C  -1.643866 0.474756 0.463317
C  -0.315927 0.834179 -0.238887
C  -6.748743 0.909791 0.346654
C  0.923954 0.214788 0.444749
C  -6.85824 -0.48647 -0.302717
C  2.251344 0.552968 -0.270568
C  3.493511 -0.056462 0.417786
C  -5.549121 -1.279083 -0.199727
C  4.819066 0.27553 -0.30401
C  6.062312 -0.33218 0.384204
C  7.386814 -0.00579 -0.34213
C  -5.643105 -2.762163 -0.508473
C  8.629843 -0.615792 0.345417
C  9.947868 -0.289453 -0.39006
H  -4.132802 0.753813 1.521161
H  -2.804419 2.236663 -0.102375
H  -2.885342 0.899855 -1.279959
H  -5.360201 1.671149 -1.155482
H  -5.30592 2.567077 0.38478
H  -1.590322 0.783939 1.529084
H  -1.793829 -0.621837 0.45921
H  -0.19925 1.938557 -0.273182
H  -0.358931 0.494304 -1.295046
H  -7.602846 1.544513 0.046595
H  -6.790338 0.808934 1.449547
H  0.80218 -0.887628 0.49114
H  0.974948 0.56534 1.49708
H  -7.674131 -1.080132 0.154579
H  -7.120277 -0.390177 -1.377764
H  2.367591 1.656055 -0.324808
H  2.2020 0.194882 -1.320415
H  3.546266 0.30611 1.465936
H  3.37491 -1.15886 0.477025
H  4.766004 -0.088696 -1.351552
H  4.936711 1.378008 -0.365147
H  5.942445 -1.4342 0.449002
H  6.118203 0.035312 1.430509
H  7.331677 -0.372885 -1.388608
H  7.508981 1.096021 -0.406501
H  -6.1080 -2.931378 -1.499503
H  -6.281738 -3.277829 0.235523
H  -4.639991 -3.216214 -0.494779
H  8.504664 -1.716013 0.412277
H  8.685949 -0.246208 1.389837
H  9.927988 -0.675242 -1.426962
H  10.111274 0.803702 -0.443332
H  10.820444 -0.737095 0.120666
