program: Gaussian 09
title: 000182225
version: EM64L-G09RevD.01
frameworkgroup: C1[X(C18H26)]
method: RPBEPBE
basis: SDD
operation: Freq
keyword: #p
keyword: freq=noraman
keyword: PBEPBE/SDD
title: #p freq=noraman PBEPBE/SDD
converged: NO YES NO NO
title: Mulliken charges:
elementType: C C C C C C C C C C C C C C C C C C H H H H H H H H H H H H H H H H H H H H H H H H H H
charge: -0.105331 0.270577 0.301457 -0.537178 -0.516227 -0.428651 -0.440745 -0.843877 -0.221911 -0.261570 -0.228501 -0.233685 -0.715126 -0.733276 -0.297140 -0.287449 -0.226372 -0.231734 0.186689 0.200414 0.275464 0.195824 0.265189 0.195917 0.196439 0.213791 0.234301 0.223219 0.219465 0.236177 0.242385 0.236610 0.208963 0.208349 0.236808 0.225765 0.205420 0.216485 0.235838 0.215310 0.212660 0.215642 0.216794 0.216823
chargesum: 0.00000
title: Mulliken charges with hydrogens summed into heavy atoms:
elementType: C C C C C C C C C C C C C C C C C C
charge: 0.081358 0.270577 0.301457 -0.061300 -0.055213 -0.036295 0.007346 -0.165016 0.020474 -0.024960 -0.019539 -0.025336 -0.047133 -0.065643 -0.084480 -0.071807 -0.009579 -0.014911
polarizability: 1.94606694e+02 4.08515939e-01 1.87064459e+02 5.19893222e+00 1.31530704e+00 1.71120571e+02
1716.lowfreq: -18.5285 -13.4444 -10.2198 -0.0001 0.0006 0.0007 43.2405 61.2012 86.0306
frequency: 42.6532 61.0021 85.9847 97.5542 104.4405 136.3979 172.5142 176.5809 194.1815 201.1196 216.9735 225.3871 245.3106 256.0116 270.6538 291.7968 309.7657 344.5282 353.4233 375.6738 389.9261 414.7714 435.1507 453.4949 521.2076 543.5766 559.4996 564.7687 580.1376 610.6078 668.5833 676.2642 696.5030 699.0192 760.5780 773.9656 787.9715 797.1226 815.3248 828.2658 887.5601 897.8248 937.0705 942.7216 952.1845 957.8400 961.0349 962.7059 967.7597 972.8839 974.7097 979.8347 986.4440 991.7521 1013.7976 1034.9147 1043.4855 1061.0640 1067.0225 1077.7749 1087.5355 1128.2484 1135.2596 1145.1866 1153.8749 1180.5642 1187.3873 1200.9065 1222.7949 1225.7633 1233.1950 1272.8760 1274.5495 1303.3467 1309.4937 1317.8667 1322.4688 1328.7620 1342.9574 1356.0847 1368.0623 1384.8320 1391.1436 1401.5641 1403.7046 1411.8801 1446.0381 1453.4039 1462.6226 1467.0117 1475.4309 1479.3728 1481.3483 1482.0576 1494.4107 1503.1179 1595.0410 1607.4106 1643.7300 1653.7673 2940.9283 2947.3320 2953.1103 2960.3338 2980.0745 2983.0060 2984.2478 2988.2066 2994.4793 3007.7526 3021.7202 3030.9855 3068.4744 3071.4474 3078.8900 3081.0875 3089.3561 3091.9843 3094.0681 3102.4605 3108.8345 3109.4377 3127.0001 3132.8986 3146.7467 3147.4600
redmass: 3.7047 3.6397 3.1051 2.3311 2.4709 2.6296 1.8906 3.1496 2.7441 2.4671 1.8281 2.8415 1.2318 1.3749 1.8459 1.8618 2.7732 2.6597 2.4542 2.5242 2.2318 3.2850 2.5134 3.1273 2.6695 2.7234 4.7633 5.3291 2.9913 2.1976 3.0062 2.1144 1.7360 1.6883 1.3071 1.3068 1.3823 1.3786 2.3478 2.2583 2.5111 3.7501 2.1327 2.2283 1.8695 1.6425 1.8918 1.6932 1.9031 1.5244 1.5389 1.4325 2.3378 1.8504 1.7600 1.6872 2.7217 1.9795 2.8510 2.1269 2.1697 2.5533 1.5141 1.7263 1.6427 1.1265 1.1835 1.2242 1.3433 1.4302 1.3000 1.1957 1.1788 1.3725 1.4218 1.3732 1.5378 1.3563 1.3963 1.5083 1.4806 1.2188 1.2122 1.4212 1.4621 1.5580 1.0853 1.0884 1.0821 1.0726 1.0517 1.0446 1.0516 1.0486 1.0548 1.0515 8.1540 8.2145 5.6238 5.6543 1.0803 1.0603 1.0644 1.0612 1.0414 1.0544 1.0383 1.0943 1.0404 1.0959 1.0950 1.0998 1.0982 1.0981 1.0998 1.0969 1.0981 1.0992 1.0847 1.0830 1.0851 1.0863 1.0967 1.0956 1.1009 1.1008
irintensity: 0.0441 0.0435 0.1161 0.0719 0.0279 0.0169 0.2463 0.0686 0.3989 0.1258 0.0577 0.1070 0.2581 0.2431 0.0755 0.1924 0.1679 0.5906 0.0932 0.3467 0.6117 2.8805 4.4366 2.9531 2.9923 15.4186 0.9504 1.3325 4.7913 15.3201 6.0904 40.1042 51.4822 33.5139 1.3619 7.1421 10.1054 23.2841 8.6341 6.3951 1.2383 3.3489 18.0567 8.3938 5.0183 6.5499 1.8551 7.0472 2.7004 3.0874 5.6794 0.7265 1.6451 2.5337 4.5941 3.7475 6.2994 10.6067 0.4301 2.0687 6.8808 2.7833 9.1809 0.1880 0.3821 0.3910 0.8960 12.7215 3.5520 2.3114 1.4499 1.3314 2.7152 4.1662 2.8924 3.4409 16.9120 0.9046 1.2093 6.9700 5.2717 23.0061 14.3451 19.1914 7.2629 8.7555 7.2574 9.1644 8.4671 9.1557 13.8343 10.3921 10.4161 7.7623 3.2052 9.6864 3.5191 4.0109 1.0973 1.3305 7.3171 12.1187 56.7486 4.8318 34.1249 19.0272 48.2090 20.3376 21.3171 25.5516 23.5549 14.7162 48.3190 34.9295 44.0155 43.3104 25.7715 39.9860 5.6019 0.4951 0.9141 10.6930 47.4494 45.5523 43.4921 39.9152
temp: 298.150 k
press: 1.00000 atm
elementType: 6 6 6 6 6 6 6 6 6 6 6 6 6 6 6 6 6 6 1 1 1 1 1 1 1 1 1 1 1 1 1 1 1 1 1 1 1 1 1 1 1 1 1 1
symmnumber: 1
zpe: 1016744.9 jmol-1
zpe.correction: 0.387258 hartree
zpe.thermalcorrener: 0.405782 hartree
zpe.thermalcorrenthalpy: 0.406726 hartree
zpe.thermalcorrgfe: 0.342630 hartree
zpe.sumelectzpe: -700.044208 hartree
zpe.sumelectthermal: -700.025684 hartree
zpe.sumelectthermalent: -700.024739 hartree
zpe.sumelectthermalfe: -700.088836 hartree
dipole: -0.2393 0.5941 -0.0417
dipole: 0.6419
quadrupole: -114.8792 -110.3765 -105.9376
quadrupole: -0.0044 0.3523 0.5477
quadrupole: -4.4815 0.0213 4.4602 -0.0044 0.3523 0.5477
hfenergy: -700.4314654 hartree
pointgroup: C01 [X(C18H26)]
dipole: 0.0996144 -0.2309921 -0.0221854 debye
polarizability: 193.6322211|0.4577524|187.0678406|-6.9193158|-1.6509691|172.0916615 unknown
InChI: InChI=1S/C18H26/c1-4-17(12-8-6-9-13-17)16(3)18(5-2)14-10-7-11-15-18/h6-12,14,16H,4-5,13,15H2,1-3H3
charge 0 multiplicity 1
44 atoms
C  0.170976 -1.307473 0.085406
C  -1.294941 -0.645235 0.047732
C  1.442533 -0.358281 -0.002616
C  -1.405231 0.498119 -1.021883
C  1.450397 0.72959 1.123288
C  -2.280543 -1.811336 -0.376187
C  2.768908 -1.209676 0.158701
C  0.30497 -2.284114 1.290098
C  -1.733251 -0.148495 1.429502
C  1.583007 0.303979 -1.382097
C  -2.452914 1.563725 -0.755605
C  2.412401 1.879386 0.865117
C  -3.762805 -1.433722 -0.579733
C  3.001943 -2.325501 -0.884079
C  -2.520107 0.951788 1.622508
C  2.264197 1.476786 -1.55913
C  -2.946624 1.795984 0.495074
C  2.774875 2.233918 -0.40418
H  0.214087 -1.928497 -0.836912
H  -1.575532 0.040499 -2.018817
H  -0.437102 1.028222 -1.118504
H  1.70114 0.245135 2.088477
H  0.435126 1.154865 1.262905
H  -2.235757 -2.622354 0.376123
H  -1.885819 -2.23945 -1.322863
H  2.793755 -1.640917 1.178195
H  3.611972 -0.493887 0.107545
H  0.54543 -1.75161 2.227935
H  -0.622507 -2.85495 1.462961
H  1.104177 -3.024319 1.118544
H  -1.463607 -0.768706 2.29296
H  1.223774 -0.260347 -2.254124
H  -2.745649 2.202651 -1.599835
H  2.754157 2.46728 1.727309
H  -4.188625 -0.973056 0.328724
H  -3.898186 -0.720041 -1.410985
H  -4.352668 -2.340523 -0.812101
H  2.210134 -3.096618 -0.860502
H  3.047773 -1.915719 -1.908704
H  3.964174 -2.834482 -0.689109
H  -2.850969 1.218431 2.634428
H  2.4331 1.872601 -2.568174
H  -3.656157 2.611923 0.677594
H  3.427392 3.097724 -0.579987
