program: Gaussian 09
title: 000182224
version: EM64L-G09RevD.01
frameworkgroup: C1[X(C4H6Cl3NO2)]
method: RPBEPBE
basis: SDD
operation: Freq
keyword: #p
keyword: freq=noraman
keyword: PBEPBE/SDD
title: #p freq=noraman PBEPBE/SDD
converged: YES YES NO NO
title: Mulliken charges:
elementType: Cl Cl Cl O O N C C C C H H H H H H
charge: 0.110930 0.137562 0.056385 -0.476997 -0.220706 -0.339430 -0.329328 -0.312381 0.435427 -0.697234 0.248472 0.252360 0.351331 0.207491 0.214378 0.361740
chargesum: 0.00000
title: Mulliken charges with hydrogens summed into heavy atoms:
elementType: Cl Cl Cl O O N C C C C
charge: 0.110930 0.137562 0.056385 -0.115257 -0.220706 0.011901 0.171504 0.109488 0.435427 -0.697234
polarizability: 1.00759368e+02 -8.11437223e+00 8.73681165e+01 -1.21511863e+00 6.54905859e-01 7.47728905e+01
1716.lowfreq: -6.2312 -0.0023 -0.0023 0.0013 2.6223 4.8370 14.1381 46.0073 75.7831
frequency: 11.3272 45.9533 75.7784 99.8861 160.9151 179.5497 221.5092 249.4504 263.5909 275.0759 289.8700 318.8019 371.9803 378.6881 506.2250 620.0320 693.7450 712.0805 734.0950 763.2994 828.2285 896.5897 946.9160 1043.5084 1069.6128 1096.7454 1173.8084 1202.9244 1227.8082 1271.9008 1356.7539 1401.5278 1462.7748 1473.9834 1480.9574 1637.9876 2966.9653 3000.5988 3031.2330 3089.9454 3507.5922 3595.5915
redmass: 11.4141 4.4787 7.0779 3.5314 9.5684 8.2567 9.3952 10.9220 4.6470 3.1531 2.0685 3.0925 25.7872 4.5006 2.7212 11.8581 4.0242 2.3604 2.2727 8.6406 2.1425 3.3027 4.3310 3.1359 1.9823 2.3933 1.2787 1.1949 1.8065 1.2056 1.3266 1.4641 1.0807 1.0969 1.8136 10.9044 1.0556 1.0693 1.1038 1.0986 1.0778 1.0669
irintensity: 1.0397 5.6786 0.6720 6.1789 5.2813 7.0523 4.2586 1.9467 18.8200 29.9968 110.4024 10.8942 5.2006 37.6601 8.3563 130.6506 58.9183 60.8920 136.6970 103.0352 29.2963 5.6448 25.2564 58.4713 15.2507 2.5602 42.4742 13.6712 14.9652 62.4866 4.0185 0.1991 29.0817 6.2010 220.6488 197.0966 60.6933 6.9855 73.9700 7.8664 65.5051 8.4368
temp: 298.150 k
press: 1.00000 atm
elementType: 17 17 17 8 8 7 6 6 6 6 1 1 1 1 1 1
symmnumber: 1
zpe: 273560.9 jmol-1
zpe.correction: 0.104194 hartree
zpe.thermalcorrener: 0.116091 hartree
zpe.thermalcorrenthalpy: 0.117035 hartree
zpe.thermalcorrgfe: 0.063176 hartree
zpe.sumelectzpe: -1740.594766 hartree
zpe.sumelectthermal: -1740.582869 hartree
zpe.sumelectthermalent: -1740.581924 hartree
zpe.sumelectthermalfe: -1740.635783 hartree
dipole: -5.3048 1.6693 -0.8632
dipole: 5.6278
quadrupole: -62.4965 -84.5947 -78.5651
quadrupole: 0.6532 5.1172 -2.3858
quadrupole: 12.7223 -9.3759 -3.3463 0.6532 5.1172 -2.3858
hfenergy: -1740.6989598 hartree
pointgroup: C01 [X(C4H6Cl3N1O2)]
dipole: 2.0733906 -0.4973098 -0.5968379 debye
dipolederiv: -0.3145516 -0.0707002 0.238087 -0.0669425 -0.1511559 0.110562 0.2449654 0.1067553 -0.674984 -0.4036997 0.1868779 -0.2612221 0.1927287 -0.2424378 0.1915885 -0.2436324 0.1940988 -0.3651895 -0.2803414 0.138412 0.0689472 0.0687156 -0.7388584 -0.2801308 0.025816 -0.2749147 -0.2952931 -0.4939041 0.0849243 -0.1862062 0.1461016 -0.7738288 -0.0426296 -0.2056288 -0.0062986 -0.3697077 -0.661357 -0.1059179 -0.0389947 0.2848324 -0.8998323 -0.0875768 0.0505644 -0.1251083 -0.3162361 -1.2335033 0.1818162 0.0367833 0.0996414 -0.4792582 -0.036618 0.0339124 -0.0043463 -0.4294002 0.4488812 0.0786838 0.0850314 0.3073588 0.0924963 -0.020013 0.1011581 -0.0397351 0.2722417 0.3233824 -0.0873979 0.0762036 -0.1419945 0.6752542 -0.0027854 0.0369213 0.0282897 0.2842777 1.360178 -0.0131192 0.0661797 -0.3932585 0.9587678 0.1341048 -0.0178994 0.1301752 0.0500512 0.7711664 -0.4180023 -0.0821081 -0.3633176 1.0837576 -0.0386322 -0.0444729 -0.0341194 1.409858 -0.0620934 -0.0040476 -0.0353123 -0.045683 0.0991497 0.0725538 -0.0807032 0.021266 -0.0991013 0.1027474 0.0713324 0.0022156 -0.0490004 -0.0170189 0.005946 0.0037089 0.0179433 0.1064611 0.3475717 -0.0035202 -0.0321198 -0.0314229 0.2260238 -0.0133366 -0.0417067 -0.0197199 0.3026358 -0.1893402 -0.1095921 -0.0389113 -0.0535589 -0.0646807 -0.0181743 -0.0476866 -0.0374899 0.0671927 0.0716833 0.038704 -0.0761357 0.0407638 -0.0517825 0.0393205 -0.0234527 0.0864136 -0.1586454 0.2131802 0.0315469 0.1775621 0.0050359 0.2834042 -0.0141789 0.2081362 -0.0432097 0.215839 unknown
polarizability: 100.8295628|-7.8091459|86.3938089|-2.2388271|3.3637859|75.6770039 unknown
InChI: InChI=1S/C4H6Cl3NO2/c5-4(6,7)3(10)8-1-2-9/h8-9H,1-2H2
charge 0 multiplicity 1
16 atoms
Cl -2.529343 -0.596197 1.709359
Cl -2.923182 0.606901 -1.044581
Cl -1.313415 -1.935795 -0.73231
O  3.131848 -1.203162 -0.276423
O  -0.639102 1.870185 0.525445
N  0.728234 -0.009814 0.315028
C  1.985019 0.695131 0.606028
C  3.062629 0.266156 -0.391513
C  -0.473965 0.638305 0.306198
C  -1.728363 -0.265238 0.05571
H  2.320428 0.450647 1.632215
H  1.79635 1.780371 0.550475
H  0.803614 -1.00879 0.097436
H  4.028436 0.737797 -0.119082
H  2.779421 0.56889 -1.420137
H  3.786291 -1.570685 -0.919548
