program: Gaussian 09
title: 000182221
version: EM64L-G09RevD.01
frameworkgroup: C1[X(C13H10O4)]
method: RPBEPBE
basis: SDD
operation: Freq
keyword: #pfreq=noraman
keyword: PBEPBE/SDD
title: #p freq=noraman PBEPBE/SDD
converged: YES YES NO NO
title: Mulliken charges:
elementType: O O O O C C C C C C C C C C C C C H H H H H H H H H H
charge: -0.354829 -0.420738 -0.438541 -0.246926 0.377107 0.211242 -0.506758 0.277511 -0.352307 0.117619 -0.344484 -0.191222 -0.323594 -0.319278 -0.233487 -0.209748 0.119015 0.298393 0.277966 0.278384 0.236072 0.263716 0.254421 0.231371 0.231543 0.380836 0.386718
chargesum: 0.00000
title: Mulliken charges with hydrogens summed into heavy atoms:
elementType: O O O O C C C C C C C C C C C C C
charge: -0.354829 -0.039902 -0.051823 -0.246926 0.377107 0.211242 -0.208365 0.277511 -0.074341 0.117619 -0.066100 0.044851 -0.059878 -0.064857 -0.002117 0.021794 0.119015
polarizability: 2.40196261e+02 -7.51794004e+00 1.39789097e+02 -3.88283138e+00 9.58456609e-01 9.14523702e+01
1716.lowfreq: -2.8964 -2.0358 -0.0002 0.0006 0.0007 6.6141 22.1658 31.9637 57.5827
frequency: 22.0354 31.9474 57.5801 77.4844 143.8096 154.2899 186.9621 205.5681 241.3771 280.3298 313.1142 377.6354 425.2482 436.2572 441.0069 483.3192 502.4003 516.7562 526.3176 548.5972 579.6150 595.7264 600.3165 621.1269 681.5971 693.6271 720.1353 732.8995 752.7111 756.6931 812.5329 817.0578 848.8115 901.1174 922.7233 930.6629 937.6907 969.8021 986.6186 992.7231 1022.7612 1040.3058 1079.6962 1089.2214 1118.1207 1158.5914 1166.6263 1175.9104 1180.3839 1206.8268 1251.2587 1280.7447 1309.4210 1323.3673 1392.9877 1401.7257 1439.4975 1453.9562 1467.7120 1480.2924 1583.7838 1604.2585 1612.1987 1619.4995 1644.7991 3139.7169 3145.4627 3151.3742 3166.3724 3167.6207 3171.8298 3179.0502 3188.2759 3512.9842 3531.7375
redmass: 6.3277 5.9794 8.5792 5.8123 6.8451 5.2013 5.4134 4.6127 6.3603 5.1478 6.5685 7.6392 3.1515 3.6264 4.4115 5.1993 3.6801 1.5396 2.2719 4.8822 6.8043 4.6354 2.0041 2.4977 2.7765 4.9448 5.0567 3.4419 2.1055 2.0840 1.5312 6.1204 1.3690 5.8499 1.4203 1.4160 1.4094 1.2944 6.2438 1.3420 2.1336 2.6693 2.2025 1.6438 1.5158 1.5076 1.1049 2.2648 1.1187 2.6395 2.2860 1.4283 1.6583 2.4306 7.1258 6.2462 3.2541 2.4446 2.6082 3.1071 6.7493 6.7860 6.7297 6.8796 8.8052 1.0855 1.0879 1.0907 1.0954 1.0946 1.0926 1.0995 1.0964 1.0645 1.0642
irintensity: 1.0495 0.5152 0.8573 0.1810 0.3865 1.8656 0.3413 1.2780 3.9179 3.7060 5.5291 13.1412 4.9466 16.3912 8.9007 0.8423 25.3526 76.2592 57.2084 2.7088 16.4961 33.3050 83.2306 60.5474 0.4084 7.6497 10.5508 69.0608 60.5829 58.6389 26.3438 9.1393 1.5938 170.6098 8.7986 7.9364 10.8021 0.1468 1.8670 0.7633 35.5042 193.7853 30.5375 12.5649 23.0369 37.1852 36.6723 259.6355 2.9652 240.0011 95.5686 33.7701 75.4119 127.8919 6.9189 17.7524 162.1082 35.1561 9.2718 138.5290 85.4362 24.3220 14.5610 8.6156 261.3383 0.4030 10.1405 16.0483 9.8277 4.4822 4.5924 10.7721 3.1372 68.2277 51.0011
temp: 298.150 k
press: 1.00000 atm
elementType: 8 8 8 8 6 6 6 6 6 6 6 6 6 6 6 6 6 1 1 1 1 1 1 1 1 1 1
symmnumber: 1
zpe: 522077.8 jmol-1
zpe.correction: 0.198849 hartree
zpe.thermalcorrener: 0.213182 hartree
zpe.thermalcorrenthalpy: 0.214126 hartree
zpe.thermalcorrgfe: 0.155792 hartree
zpe.sumelectzpe: -801.084140 hartree
zpe.sumelectthermal: -801.069807 hartree
zpe.sumelectthermalent: -801.068863 hartree
zpe.sumelectthermalfe: -801.127198 hartree
dipole: 0.4771 3.3256 0.5230
dipole: 3.4001
quadrupole: -85.8421 -97.9855 -100.5869
quadrupole: -0.9737 4.6172 -1.6887
quadrupole: 8.9627 -3.1807 -5.7820 -0.9737 4.6172 -1.6887
hfenergy: -801.2829892 hartree
pointgroup: C01 [X(C13H10O4)]
dipole: -0.2092082 -0.158878 -1.3116529 debye
polarizability: 239.894612|1.9720341|91.3962615|-9.708792|-1.3525784|140.1468553 unknown
InChI: InChI=1S/C13H10O4/c14-11-6-1-2-7-12(11)17-10-5-3-4-9(8-10)13(15)16/h1-8,14-15H
charge 0 multiplicity 1
27 atoms
O  0.713249 0.105406 0.841461
O  2.828794 -1.152056 2.004075
O  -5.283191 -0.152167 -0.085601
O  -4.267597 0.724959 1.809085
C  -0.444428 -0.169304 0.068841
C  1.983541 0.292928 0.216542
C  -1.672852 0.146288 0.678552
C  -2.878373 -0.15745 0.000716
C  -0.396004 -0.78396 -1.205221
C  3.059044 -0.347661 0.8864
C  -2.850872 -0.768285 -1.279792
C  -1.607797 -1.076701 -1.870638
C  2.20692 1.125488 -0.89543
C  4.375812 -0.16795 0.412718
C  3.528394 1.298651 -1.368348
C  4.605024 0.650857 -0.715026
C  -4.157055 0.188897 0.680428
H  -1.700835 0.619873 1.664179
H  0.565628 -1.035134 -1.662661
H  -3.791327 -0.993535 -1.788238
H  -1.574499 -1.555413 -2.854842
H  1.36608 1.633795 -1.378379
H  5.195382 -0.668973 0.935999
H  3.713466 1.94286 -2.233611
H  5.628256 0.787887 -1.07998
H  1.858417 -1.127545 2.219612
H  -6.101178 0.102441 0.419759
