program: Gaussian 09
title: 000182217
version: EM64L-G09RevD.01
frameworkgroup: C1[X(C17H26O2)]
method: RPBEPBE
basis: SDD
operation: Freq
keyword: #pfreq=noraman
keyword: PBEPBE/SDD
title: #p freq=noraman PBEPBE/SDD
converged: NO YES NO NO
title: Mulliken charges:
elementType: O O C C C C C C C C C C C C C C C C C H H H H H H H H H H H H H H H H H H H H H H H H H H
charge: -0.283251 -0.251481 0.260447 -0.224827 0.232188 -0.662190 0.206843 0.432217 -0.549880 -0.465244 -0.091596 -0.490537 -0.472034 -0.766527 -0.756277 -0.792551 -0.790565 0.291022 -0.766953 0.237616 0.248207 0.227644 0.235090 0.245896 0.213462 0.211948 0.250108 0.215732 0.238587 0.224456 0.227550 0.210211 0.208133 0.210113 0.226253 0.215040 0.215108 0.241041 0.213206 0.226627 0.213520 0.243145 0.246446 0.249855 0.246205
chargesum: 0.00000
title: Mulliken charges with hydrogens summed into heavy atoms:
elementType: O O C C C C C C C C C C C C C C C C C
charge: -0.283251 -0.251481 0.260447 0.012789 0.232188 -0.186340 0.206843 0.432217 -0.068894 -0.039835 0.158512 -0.274805 -0.008992 -0.120633 -0.104871 -0.123197 -0.107273 0.291022 -0.024446
polarizability: 2.02409826e+02 -7.15007839e-01 1.64164919e+02 -5.50489278e+00 -1.01798242e+00 1.70823137e+02
1716.lowfreq: -39.8176 -22.3799 -15.3734 -7.6021 -0.0007 -0.0006 -0.0005 35.0460 50.2363
frequency: -39.7436 34.9267 50.2039 68.1969 96.1220 142.7587 174.3996 189.3192 199.8069 201.6433 213.0900 241.1980 257.2871 261.3503 263.6352 271.3519 282.4166 312.6227 324.9365 336.7406 356.9251 365.7705 395.9305 425.9187 454.9799 474.1203 488.5824 505.3916 524.8962 536.0547 577.1526 609.8967 629.2801 644.9287 724.9174 738.1122 778.9562 812.1416 823.4848 827.3253 837.2240 868.2348 893.0719 904.9472 913.0156 932.7184 937.0269 941.5233 944.4220 947.6894 971.2844 981.6616 990.6577 995.4938 1000.6576 1006.5275 1014.9988 1045.3042 1056.8107 1070.0162 1077.7160 1093.5506 1116.1799 1146.7337 1158.3355 1172.3766 1185.2890 1188.4298 1196.5017 1208.8827 1217.7002 1223.0773 1233.9679 1242.0442 1257.2630 1271.9604 1283.4985 1307.0088 1314.1346 1330.1693 1341.2662 1348.3311 1373.7256 1374.8438 1383.0158 1392.5894 1394.0616 1453.9240 1455.8275 1458.0990 1458.9098 1462.4487 1465.0795 1468.9705 1476.4427 1477.3338 1481.9681 1485.9542 1489.7028 1499.3958 1505.5458 1635.0322 1701.6698 2958.2321 2970.5735 2973.9068 2975.4296 2979.0788 3001.8361 3006.8169 3008.0839 3020.6807 3020.9600 3022.0218 3048.2918 3058.3018 3061.7159 3064.3792 3066.1008 3068.7745 3075.9839 3082.7556 3084.2131 3085.1260 3089.6848 3094.3116 3095.1666 3097.8516 3136.0886
redmass: 1.0778 6.1752 3.5844 3.8299 2.9194 2.8465 2.6856 2.6544 1.4957 2.6145 2.0436 1.3861 1.4452 1.7248 1.8656 1.7506 2.2896 1.7270 2.1304 2.4337 2.3377 2.7241 2.8101 2.4641 3.0173 2.6397 2.9582 3.0709 3.9573 3.6020 3.3233 3.6049 3.8420 4.0657 3.0235 3.8908 2.0711 1.6907 2.1990 2.3157 2.3806 3.5124 2.5609 2.6574 2.5522 1.7544 1.6078 1.7452 1.9177 2.0058 1.8577 2.0381 2.1156 1.4146 1.7260 1.7087 1.5874 1.6278 1.5215 1.7621 2.7715 1.6615 1.4539 1.9539 2.5254 2.0459 2.2817 2.2068 2.0623 2.0136 1.8449 2.0544 1.3286 1.6438 2.4265 1.8398 1.6806 1.5166 2.0402 1.4272 1.6012 1.5266 1.1918 1.2016 1.2262 1.2062 1.2029 1.0766 1.0700 1.0488 1.0562 1.0605 1.0582 1.0661 1.0564 1.0597 1.0648 1.0510 1.0754 1.0579 1.0806 10.4510 8.2434 1.0675 1.0357 1.0359 1.0361 1.0368 1.0637 1.0363 1.0616 1.0900 1.0852 1.0651 1.0887 1.0991 1.0993 1.0997 1.0983 1.0984 1.1011 1.0991 1.0997 1.0995 1.0908 1.0987 1.0972 1.1011 1.1012
irintensity: 1.5766 1.3035 1.6254 0.2390 1.2566 1.4865 1.6937 0.7854 1.3866 4.8790 0.7459 0.0272 0.3261 0.3271 0.9855 1.4249 0.6036 0.0466 0.1487 0.6269 0.1616 1.8243 0.0673 0.1997 2.9747 0.3606 1.7032 1.3903 2.8969 2.9189 2.4685 1.5666 2.3404 4.5953 1.1100 1.3452 3.0287 1.6664 6.0278 1.0755 14.6023 6.9950 6.2035 56.9921 17.8808 2.8557 1.4333 3.1541 2.2197 14.3529 4.2171 32.9120 47.9274 14.2677 8.8225 5.2011 5.9780 7.3981 1.8193 11.1167 2.9068 1.7812 3.6410 6.9981 2.0098 10.3035 1.5703 245.9242 78.4260 100.1928 9.6634 3.6728 4.6492 2.5296 10.1387 6.6357 1.8294 3.8361 0.3813 5.8773 0.5718 9.2054 8.3308 25.0568 64.1538 26.8345 8.9523 23.9487 6.8456 11.9615 2.2543 5.1804 5.1526 4.5660 5.9981 3.1815 11.6236 8.0542 15.8002 9.6463 4.9679 204.7911 3.4384 27.5684 25.2223 50.9121 21.4660 31.2791 35.1339 4.9660 28.6284 26.7343 14.4443 51.7289 56.1525 8.3336 5.6088 8.4440 63.5124 66.1178 26.2061 52.9049 15.0017 24.2840 37.7925 46.0178 6.1125 19.1338 11.0403
temp: 298.150 k
press: 1.00000 atm
elementType: 8 8 6 6 6 6 6 6 6 6 6 6 6 6 6 6 6 6 6 1 1 1 1 1 1 1 1 1 1 1 1 1 1 1 1 1 1 1 1 1 1 1 1 1 1
symmnumber: 1
zpe: 1027744.0 jmol-1
zpe.correction: 0.391447 hartree
zpe.thermalcorrener: 0.410116 hartree
zpe.thermalcorrenthalpy: 0.411060 hartree
zpe.thermalcorrgfe: 0.346541 hartree
zpe.sumelectzpe: -812.370955 hartree
zpe.sumelectthermal: -812.352287 hartree
zpe.sumelectthermalent: -812.351342 hartree
zpe.sumelectthermalfe: -812.415862 hartree
dipole: -1.7682 -0.1177 1.2380
dipole: 2.1617
quadrupole: -124.8712 -112.0106 -114.8546
quadrupole: -2.8321 7.2235 -0.7331
quadrupole: -7.6257 5.2349 2.3908 -2.8321 7.2235 -0.7331
hfenergy: -812.7624024 hartree
pointgroup: C01 [X(C17H26O2)]
dipole: -0.7307965 0.0460706 0.4325991 debye
polarizability: 203.0726679|-1.0841296|163.9839361|-2.8439428|0.3063866|170.3412781 unknown
InChI: InChI=1S/C17H26O2/c1-11(18)19-14-7-6-13-15(2,3)12-8-9-17(13,10-12)16(14,4)5/h6,12,14H,7-10H2,1-5H3
charge 0 multiplicity 1
45 atoms
O  2.112414 -0.321518 0.485577
O  4.231537 -0.50662 -0.480959
C  -0.714859 0.64695 0.284508
C  -2.900272 0.102361 0.774732
C  -2.571525 -0.858809 -0.43253
C  -2.093932 1.384113 0.40679
C  0.533237 1.458053 -0.193448
C  -1.093613 -0.478925 -0.688525
C  -0.641167 -0.029294 1.711533
C  -2.140754 -0.344071 2.056305
C  1.636232 0.479794 -0.700152
C  -0.247752 -1.003711 -1.606441
C  1.166516 -0.489448 -1.805264
C  -2.755916 -2.365221 -0.117353
C  -3.465442 -0.51295 -1.65905
C  1.117821 2.372908 0.912636
C  0.149616 2.355356 -1.409449
C  3.439452 -0.753924 0.459234
C  3.776318 -1.546085 1.706259
H  -3.985505 0.24161 0.920351
H  -2.425047 1.861227 -0.529524
H  -2.108468 2.136374 1.217261
H  -0.207617 0.670731 2.447074
H  -0.002926 -0.925939 1.689758
H  -2.308721 -1.403375 2.312553
H  -2.482026 0.257333 2.919368
H  2.512511 1.052163 -1.060989
H  -0.578744 -1.810202 -2.277053
H  1.890952 -1.323271 -1.875602
H  1.237174 0.036451 -2.781358
H  -2.047845 -2.720286 0.650455
H  -3.78538 -2.570516 0.234474
H  -2.584768 -2.970304 -1.027218
H  -4.518497 -0.788348 -1.457554
H  -3.434809 0.561912 -1.909429
H  -3.129803 -1.072801 -2.55129
H  0.334791 3.033599 1.32874
H  1.556438 1.790299 1.739439
H  1.913587 3.017975 0.493626
H  -0.495637 3.188189 -1.078991
H  1.053726 2.79753 -1.869431
H  -0.394554 1.787415 -2.184171
H  4.074346 -2.569881 1.419765
H  2.921965 -1.590508 2.396873
H  4.642246 -1.083737 2.210969
