program: Gaussian 09
title: 000182213
version: EM64L-G09RevD.01
frameworkgroup: C1[X(C25H15N5O)]
method: RPBEPBE
basis: SDD
operation: Freq
keyword: #p
keyword: freq=noraman
keyword: PBEPBE/SDD
title: #p freq=noraman PBEPBE/SDD
converged: YES YES NO NO
title: Mulliken charges:
elementType: O N N N N N C C C C C C C C C C C C C C C C C C C C C C C C C H H H H H H H H H H H H H H H
charge: -0.250637 -0.399285 -0.076318 -0.396903 -0.046880 -0.623142 -0.024936 0.317960 0.271660 -0.044818 -0.041343 0.166394 0.285133 0.491705 0.494629 -0.431267 -0.439276 0.045371 -0.516833 -0.524264 -0.382120 -0.425795 -0.471282 -0.468029 -0.246298 0.033488 -0.275017 -0.273657 0.088353 -0.013179 0.152250 0.275366 0.229053 0.237544 0.240402 0.232008 0.277046 0.245175 0.245259 0.353283 0.229862 0.233733 0.236628 0.320278 0.356007 0.312688
chargesum: 0.00000
title: Mulliken charges with hydrogens summed into heavy atoms:
elementType: O N N N N N C C C C C C C C C C C C C C C C C C C C C C C C C
charge: -0.250637 -0.046002 -0.076318 -0.076625 -0.046880 0.045552 -0.024936 0.317960 0.271660 -0.044818 -0.041343 0.166394 0.285133 0.491705 0.494629 -0.155900 -0.210223 0.045371 -0.279289 -0.283862 -0.150112 -0.148749 -0.226107 -0.222770 -0.016437 0.033488 -0.041284 -0.037029 0.088353 -0.013179 0.152250
polarizability: 5.59869178e+02 5.30963106e+01 4.19282063e+02 -8.53700032e+00 1.02121235e+01 1.52400889e+02
1716.lowfreq: -0.0006 -0.0005 0.0007 2.2461 5.7851 9.1069 24.3298 32.6023 38.8958
frequency: 23.8504 32.2430 38.7932 62.5160 84.2434 105.9870 139.7361 147.8207 172.6492 177.4640 191.9636 206.9633 223.1398 236.4266 244.4612 277.2833 295.2247 320.6613 330.3504 333.0726 368.5181 371.9516 397.2112 443.6733 458.5807 472.9616 482.7808 498.4496 510.1658 513.2400 515.3038 524.4324 528.6247 540.4177 560.3891 569.7908 589.3286 601.9012 626.3157 632.8893 651.5922 657.6703 669.1481 689.2039 696.4748 705.2246 714.7300 725.6378 737.2960 768.5609 772.1674 783.4370 791.3248 799.7864 809.1590 834.8041 846.1366 867.6722 873.7525 877.3521 906.4511 918.9600 953.1950 963.5757 967.0726 975.2771 987.6153 990.1246 992.4504 997.7567 1019.3552 1026.0818 1033.6228 1050.3537 1081.8733 1119.7552 1136.2922 1157.4228 1163.2912 1183.0878 1187.8594 1197.8264 1200.1185 1204.4757 1234.1806 1259.9888 1267.3973 1270.4786 1281.5381 1307.8622 1323.9586 1332.2269 1372.8080 1388.6243 1394.7727 1401.2683 1409.4384 1418.5838 1427.1094 1429.1796 1435.8490 1459.4893 1474.7922 1484.1166 1497.5487 1515.2253 1521.3929 1542.7498 1554.8306 1587.6438 1590.4492 1591.5219 1606.9233 1614.8712 1617.8958 1631.4761 1635.7540 3124.9123 3129.1537 3129.8668 3133.8980 3134.3000 3147.9671 3158.9950 3160.2536 3168.4012 3175.5557 3181.8869 3549.7901 3556.9225 3577.8139 3708.0515
redmass: 6.9551 6.2413 6.2006 5.2838 5.0222 4.6343 4.7561 7.1548 6.7898 5.0248 4.3629 8.4648 4.3327 1.1846 5.5877 6.0263 4.7698 6.0996 6.7740 4.0347 4.8294 5.2939 5.9048 3.9352 4.6377 3.9168 6.8293 7.2270 6.0451 1.1401 3.9333 5.5031 4.1409 5.5299 1.1849 3.1569 6.7925 6.1910 5.7418 6.0682 4.6475 8.8250 7.3955 7.1763 3.2342 2.3675 1.8452 3.8931 3.6584 11.0375 1.2441 1.6476 4.3544 2.5353 5.3920 5.7846 1.6216 5.7563 2.6132 1.5237 7.1628 1.4717 6.0056 5.2618 1.4360 1.3543 1.4055 2.0078 1.4555 1.3342 5.6030 5.2182 6.0146 2.1928 2.0670 2.4471 1.9800 2.5392 1.4938 1.2939 1.1410 3.5382 2.7720 1.3010 1.8089 2.0700 1.6966 2.2234 2.3680 3.8399 2.7652 3.0098 3.7209 4.0296 4.5995 2.6195 5.3995 3.1548 3.7484 2.8066 4.7541 3.2701 4.0522 4.9731 4.5713 4.8568 4.1262 4.4164 6.9825 6.9993 3.3107 2.6256 6.4492 10.3352 5.9694 2.2708 7.0051 1.0863 1.0890 1.0892 1.0873 1.0898 1.0893 1.0989 1.0955 1.0959 1.0959 1.0941 1.0686 1.0547 1.0820 1.1054
irintensity: 4.1173 0.4367 0.4602 1.0978 0.6248 5.0449 1.3907 2.4515 1.1298 3.3082 2.4911 3.0410 8.3095 45.1037 2.3090 16.9023 1.6634 10.6737 1.5840 1.3345 13.0343 4.5293 1.2073 2.6257 0.8583 1.5260 3.3858 0.9454 3.8517 319.0135 8.4783 0.3725 1.3446 3.7839 20.1421 3.0863 2.3058 1.6352 2.6002 2.1690 0.1612 1.8749 0.4040 0.9488 36.8373 31.0051 58.0638 16.3689 16.8093 5.3789 3.5428 54.8807 18.1414 12.1919 4.7944 0.6925 1.8545 1.4757 38.5662 48.1649 5.7480 0.4465 13.4522 10.8431 2.1212 0.1647 1.8908 59.7034 10.3290 0.2215 3.6277 5.0780 3.0726 9.3267 4.0056 0.0786 1.4709 1.2304 1.0309 0.4211 1.3629 74.8004 6.4445 10.7799 1.3076 10.2704 80.0044 4.6880 77.0536 24.6594 51.5446 30.0454 15.7371 20.8433 1.8284 4.4204 107.3160 4.7594 8.9847 0.8996 69.7312 120.4865 15.7251 84.6774 10.3087 76.9502 63.3014 103.1728 2.4224 18.9785 70.1777 34.9526 2.2768 424.7652 8.3534 779.6482 8.6896 0.4373 5.9917 3.9152 2.1033 24.4299 8.7541 49.7510 2.4493 30.0575 45.3119 7.1349 60.0138 132.0089 66.7990 46.8647
temp: 298.150 k
press: 1.00000 atm
elementType: 8 7 7 7 7 7 6 6 6 6 6 6 6 6 6 6 6 6 6 6 6 6 6 6 6 6 6 6 6 6 6 1 1 1 1 1 1 1 1 1 1 1 1 1 1 1
symmnumber: 1
zpe: 905911.1 jmol-1
zpe.correction: 0.345043 hartree
zpe.thermalcorrener: 0.367260 hartree
zpe.thermalcorrenthalpy: 0.368204 hartree
zpe.thermalcorrgfe: 0.293740 hartree
zpe.sumelectzpe: -1308.682931 hartree
zpe.sumelectthermal: -1308.660714 hartree
zpe.sumelectthermalent: -1308.659770 hartree
zpe.sumelectthermalfe: -1308.734234 hartree
dipole: -2.7773 -3.3138 -4.1717
dipole: 6.0081
quadrupole: -161.4482 -144.8665 -188.4332
quadrupole: -28.8459 -34.5159 3.2688
quadrupole: 3.4678 20.0495 -23.5172 -28.8459 -34.5159 3.2688
hfenergy: -1309.027974 hartree
pointgroup: C01 [X(C25H15N5O1)]
dipole: 1.0902989 -1.0432093 1.8194587 debye
polarizability: 558.9812095|-55.1506718|410.6669569|-1.9480605|-50.2927897|161.9039638 unknown
InChI: InChI=1S/C25H15N5O/c26-25-29-23-21(24(31)30-25)27-22(28-23)20-15-7-2-1-6-14(15)16-10-8-12-4-3-5-13-9-11-17(20)19(16)18(12)13/h1-11,27,29H,26H2
charge 0 multiplicity 1
46 atoms
O  -5.264236 0.76112 -2.195416
N  -2.484823 0.557652 -0.814284
N  -2.168192 -0.637638 1.094807
N  -4.535536 -1.385765 1.30319
N  -6.048351 -0.617437 -0.434131
N  -6.834106 -1.966341 1.301807
C  2.277792 -0.06254 0.058958
C  0.878002 -0.448287 0.176438
C  2.641497 1.312444 -0.12894
C  3.302643 -1.077782 0.108237
C  -0.136485 0.545874 0.111949
C  1.605874 2.329826 -0.16935
C  0.2161 1.943443 -0.025831
C  2.953857 -2.466699 0.275571
C  4.693073 -0.717359 -0.015155
C  0.565872 -1.858601 0.332777
C  4.040284 1.640581 -0.257215
C  -1.561921 0.156899 0.153845
C  1.554475 -2.818295 0.380515
C  5.027047 0.669822 -0.199007
C  1.913445 3.721201 -0.324814
C  -0.782296 2.979817 0.016827
C  3.976929 -3.447028 0.325243
C  5.694035 -1.730762 0.040023
C  5.338048 -3.080721 0.210103
C  -3.728102 0.014566 -0.490781
C  0.91845 4.70057 -0.317512
C  -0.444503 4.325371 -0.126918
C  -3.486653 -0.708893 0.686014
C  -5.04006 0.106337 -1.131626
C  -5.795142 -1.295356 0.685412
H  -0.481612 -2.147559 0.436064
H  4.341002 2.681205 -0.401256
H  1.290107 -3.875282 0.502376
H  6.082455 0.949674 -0.296207
H  2.952814 4.036639 -0.446942
H  -1.826776 2.713089 0.200034
H  3.700433 -4.499942 0.453646
H  6.747717 -1.444045 -0.054654
H  -2.295151 1.126479 -1.640283
H  6.115376 -3.851107 0.251061
H  1.184827 5.755719 -0.439991
H  -1.2238 5.093521 -0.082871
H  -4.368088 -1.906864 2.165136
H  -7.743185 -1.894235 0.851404
H  -6.729832 -2.50651 2.156045
