program: Gaussian 09
title: 000196169
version: EM64L-G09RevD.01
frameworkgroup: C1[X(C23H28O5)]
method: RPBEPBE
basis: SDD
operation: Freq
keyword: #pfreq=noraman
keyword: PBEPBE/SDD
title: #p freq=noraman PBEPBE/SDD
converged: YES YES NO NO
title: Mulliken charges:
elementType: O O O O O C C C C C C C C C C C C C C C C C C C C C C C H H H H H H H H H H H H H H H H H H H H H H H H H H H H
charge: -0.249568 -0.430341 -0.414192 -0.558475 -0.247528 -0.389049 -0.576331 -0.556902 0.492727 0.434310 -0.533134 -0.523890 0.185458 -0.839862 0.016310 -0.540771 0.137159 -0.370057 0.004141 0.449621 0.339106 -0.637414 -0.798242 -0.459366 0.128923 0.410214 -0.814827 -0.778816 0.213666 0.226322 0.219145 0.210928 0.203518 0.234300 0.233134 0.278608 0.259470 0.230308 0.238899 0.263232 0.258316 0.270825 0.260369 0.245411 0.245930 0.222865 0.229784 0.414140 0.383018 0.227849 0.227441 0.226180 0.240411 0.241777 0.212102 0.402843
chargesum: 0.00000
title: Mulliken charges with hydrogens summed into heavy atoms:
elementType: O O O O O C C C C C C C C C C C C C C C C C C C C C C C
charge: -0.249568 -0.016201 -0.031174 -0.155632 -0.247528 0.050939 -0.146257 -0.119083 0.492727 0.434310 -0.021391 -0.264420 0.185458 -0.107423 0.016310 -0.282455 0.137159 -0.099233 0.004141 0.449621 0.339106 -0.377045 -0.084036 -0.229581 0.128923 0.410214 -0.133357 -0.084525
polarizability: 4.04031422e+02 1.40397313e+00 2.95569685e+02 1.58762511e+01 -8.02394843e+00 1.79461927e+02
1716.lowfreq: -68.4848 -7.9256 -2.9512 -0.0007 0.0004 0.0008 2.2827 6.7151 17.3823
frequency: -68.4570 5.9497 17.2143 20.2177 22.8244 40.8436 46.0763 52.7503 62.9038 72.2401 89.4228 91.9685 98.7539 117.2100 131.2928 134.5896 186.4112 199.8432 201.3939 204.0200 210.6382 247.7031 251.8105 267.9521 277.7085 281.4035 298.3789 322.9046 330.8478 333.0090 351.9249 364.7947 370.1395 393.2139 403.5115 410.6132 421.7683 472.4829 478.1809 484.6993 524.7611 532.3083 548.2531 575.8130 579.8204 589.4260 608.3758 621.4099 631.5707 647.7819 661.7556 684.7761 701.1091 720.0189 737.1213 750.3424 762.0561 771.8848 787.4534 801.1530 806.1962 812.7414 818.9746 845.7753 862.5228 862.9871 887.5054 890.8225 919.8036 938.6442 955.6579 971.5649 977.2325 982.5224 991.7658 996.3336 1021.2070 1031.9548 1044.3825 1045.5533 1057.8891 1062.9337 1074.1257 1074.9926 1079.3353 1102.0489 1135.8096 1152.7527 1165.5636 1184.5031 1187.0861 1195.6065 1201.5396 1223.6159 1231.4098 1252.1365 1271.6634 1274.3908 1284.6319 1298.3212 1305.1056 1326.0025 1337.8648 1347.3797 1352.3407 1361.0208 1367.0865 1386.4812 1389.6504 1394.7178 1397.1339 1398.5578 1408.8027 1418.1404 1450.0881 1454.4065 1456.3887 1457.0865 1459.7916 1462.1643 1463.8624 1469.9754 1470.9775 1473.2295 1474.0729 1481.4778 1513.4709 1530.4944 1577.7795 1586.5197 1633.2469 1656.1814 1657.1803 1671.0832 2953.0255 2955.5287 2962.3803 2970.4309 2981.3788 2983.2085 2987.4500 2993.4341 3017.0371 3025.6132 3026.0526 3038.1466 3043.7325 3051.9657 3066.2670 3076.4726 3077.9769 3079.3680 3086.5504 3095.5085 3100.5233 3109.1149 3135.1681 3166.0075 3207.5583 3230.5414 3250.6551 3560.0816
redmass: 1.1198 5.8224 4.2481 4.7578 4.1389 3.0495 4.8984 4.4487 5.5973 3.5298 2.7000 7.1225 2.6530 3.5862 1.3851 3.7165 1.6341 1.2408 2.0559 1.9554 3.0750 2.3138 3.2788 3.1576 4.0157 5.4486 3.4715 4.1482 3.8826 3.3284 3.1470 7.0018 2.8983 4.2824 3.0634 8.6993 3.4154 3.6918 2.6235 3.7591 1.2158 2.5872 5.0711 5.7986 3.4646 3.2482 2.8206 2.4295 3.0795 1.7302 3.6350 4.0056 2.4636 3.2745 1.7361 2.4102 3.2823 4.1850 1.8554 1.1529 2.6352 1.7423 3.7819 1.7592 1.4474 1.4493 3.6034 1.7444 2.0281 4.5750 2.2045 1.2395 1.4636 3.3563 2.2855 1.7986 2.2166 1.6344 1.5604 1.5804 2.2997 3.4395 2.7956 1.6470 3.5203 2.5108 1.3841 1.3721 1.9630 1.4532 2.5640 1.5544 1.2896 1.4532 1.3643 2.1152 2.5172 1.3157 2.6882 1.4835 1.5794 1.6341 4.4886 1.6918 1.4006 1.6715 2.0043 1.6183 1.9508 1.2683 1.8546 1.2141 1.6220 2.5267 1.0864 1.0921 1.0456 1.1754 1.0477 1.0857 1.0472 1.1809 1.0890 1.0890 1.0913 1.0960 4.4253 2.5226 6.0259 6.0288 4.5340 6.3232 8.0353 7.1549 1.0611 1.0373 1.0637 1.0399 1.0638 1.0361 1.0614 1.0365 1.0983 1.0965 1.0961 1.0947 1.0953 1.1026 1.0964 1.0960 1.0991 1.0895 1.1002 1.1014 1.0974 1.0889 1.0667 1.0921 1.0974 1.0664 1.1000 1.0651
irintensity: 0.2681 0.0283 0.1298 0.2585 0.1407 0.3772 0.1537 0.6909 0.4248 0.2232 0.3279 0.2077 4.3459 0.5596 0.8981 0.5523 1.2864 0.4895 0.3997 1.3374 0.9992 2.4214 2.1586 1.2004 0.8369 3.6732 2.2087 4.6020 0.9828 2.2449 0.0946 0.2536 0.7962 2.4384 1.6327 5.8561 3.5421 4.7875 8.5658 6.9649 139.6426 3.6534 44.1988 30.6512 13.9496 12.2164 13.5624 13.8725 26.9293 68.5154 4.1357 6.1854 12.7304 4.4864 8.0893 11.9700 2.8544 8.2653 3.6761 140.4471 37.8790 3.0852 8.9867 5.9061 23.1265 31.8702 6.7430 49.2201 12.2070 213.1555 12.1421 2.4152 10.9416 5.5925 2.7514 4.3667 3.7774 6.5725 10.2685 3.7935 2.2228 1.7093 34.2599 8.4126 81.5768 126.8810 2.8009 21.0351 38.6225 99.9117 3.9316 2.0847 3.8413 0.7017 17.4108 193.1208 12.1870 6.1078 11.5824 1.0188 30.4351 14.1621 95.4325 7.9682 1.0288 24.0496 38.3212 20.7999 10.7705 18.2723 7.2283 1.5390 42.4925 92.6785 5.3409 7.2649 12.8667 15.4322 20.2130 7.6942 5.5507 17.2049 59.4026 9.4672 18.2100 7.5338 3.5253 9.7317 229.4557 10.9332 401.2966 14.4214 388.8020 31.9518 32.8917 62.3297 27.6058 10.5550 20.9272 26.9759 49.3252 16.7868 14.5180 23.8570 12.5444 11.5813 19.6970 61.8883 14.5653 9.9317 19.2803 29.1733 45.7778 17.8632 25.5602 19.2449 445.2763 5.1512 2.4480 564.6835 0.0393 67.9675
temp: 298.150 k
press: 1.00000 atm
elementType: 8 8 8 8 8 6 6 6 6 6 6 6 6 6 6 6 6 6 6 6 6 6 6 6 6 6 6 6 1 1 1 1 1 1 1 1 1 1 1 1 1 1 1 1 1 1 1 1 1 1 1 1 1 1 1 1
symmnumber: 1
zpe: 1196279.1 jmol-1
zpe.correction: 0.455639 hartree
zpe.thermalcorrener: 0.484477 hartree
zpe.thermalcorrenthalpy: 0.485421 hartree
zpe.thermalcorrgfe: 0.391529 hartree
zpe.sumelectzpe: -1267.266947 hartree
zpe.sumelectthermal: -1267.238109 hartree
zpe.sumelectthermalent: -1267.237165 hartree
zpe.sumelectthermalfe: -1267.331056 hartree
dipole: 0.6970 -2.7523 -1.2906
dipole: 3.1188
quadrupole: -151.3542 -162.4959 -168.6033
quadrupole: 4.1657 4.4254 -0.4513
quadrupole: 9.4636 -1.6781 -7.7855 4.1657 4.4254 -0.4513
hfenergy: -1267.7225857 hartree
pointgroup: C01 [X(C23H28O5)]
dipole: 0.2966325 -1.1006056 -0.4541376 debye
polarizability: 385.5939139|-5.0245204|296.0605446|62.729945|-10.5116752|197.4085761 unknown
InChI: InChI=1S/C23H28O5/c1-14(2)10-18-12-17(13-28-18)7-5-6-15(3)8-9-19-20(24)11-16(4)21(22(19)25)23(26)27/h8,10-13,24-26H,5-7,9H2,1-4H3
charge 0 multiplicity 1
56 atoms
O  4.530614 0.797489 0.930046
O  -5.269799 -0.906589 -1.741467
O  -1.678885 -0.149881 1.387244
O  -6.416158 1.035823 -2.789546
O  -5.884856 3.233812 -2.317876
C  1.568685 -2.609147 -0.359998
C  0.266918 -3.457771 -0.379482
C  1.624225 -1.592503 0.811409
C  -1.01145 -2.679147 -0.669711
C  2.947677 -0.870689 0.904591
C  -3.451035 -2.091221 -0.017997
C  -2.073268 -2.723957 0.195986
C  -3.507198 -0.573892 -0.194883
C  -1.044778 -1.904111 -1.974141
C  -4.47806 0.001814 -1.054746
C  4.249901 -1.45943 1.143691
C  -2.668186 0.313955 0.522954
C  3.162183 0.493243 0.782289
C  -4.628703 1.434555 -1.192235
C  -3.765117 2.300428 -0.420895
C  5.199562 -0.435907 1.157831
C  -2.802405 1.720991 0.41641
C  -3.850322 3.814693 -0.477754
C  6.634008 -0.469836 1.3600
C  -5.627363 2.02896 -2.084726
C  7.533863 0.567555 1.376424
C  9.006892 0.293262 1.611599
C  7.152856 2.025282 1.170261
H  2.431965 -3.298497 -0.281698
H  1.691156 -2.070428 -1.319265
H  0.380518 -4.234573 -1.165484
H  0.169406 -3.993072 0.585768
H  1.433664 -2.139825 1.758196
H  0.808833 -0.851581 0.70949
H  -4.088843 -2.361169 0.84736
H  -3.942791 -2.545268 -0.897789
H  -1.975638 -3.366231 1.085352
H  -0.584728 -2.499419 -2.785539
H  -0.462469 -0.964384 -1.900758
H  -2.069293 -1.633307 -2.274672
H  4.465322 -2.516365 1.297227
H  2.506125 1.341995 0.609308
H  -2.129554 2.347056 1.008646
H  -3.678373 4.196722 -1.499219
H  -4.852655 4.178525 -0.191947
H  -3.102715 4.259178 0.200199
H  7.016464 -1.486654 1.521548
H  -5.921231 -0.399962 -2.32955
H  -1.528304 -1.131393 1.21964
H  9.370308 0.837328 2.506619
H  9.615929 0.653983 0.758281
H  9.216946 -0.781066 1.753852
H  6.674015 2.182374 0.186578
H  6.415249 2.360026 1.922092
H  8.040552 2.678372 1.235459
H  -7.068559 1.502655 -3.372371
