program: Gaussian 09
title: 000196084
version: EM64L-G09RevD.01
frameworkgroup: C1[X(C7H10O2)]
method: RPBEPBE
basis: SDD
operation: Freq
keyword: #pfreq=noraman
keyword: PBEPBE/SDD
title: #p freq=noraman PBEPBE/SDD
converged: YES YES NO NO
title: Mulliken charges:
elementType: O O C C C C C C C H H H H H H H H H H
charge: -0.288308 -0.202779 -0.029715 -0.178651 -0.410110 -0.108313 -0.674597 -0.234233 -0.109140 0.228352 0.237391 0.224222 0.217079 0.238495 0.215061 0.222613 0.227650 0.261459 0.163523
chargesum: 0.00000
title: Mulliken charges with hydrogens summed into heavy atoms:
elementType: O O C C C C C C C
charge: -0.288308 -0.202779 0.198637 0.058740 0.031191 0.130181 -0.009272 0.027227 0.054383
polarizability: 1.43128864e+02 1.33081608e+01 6.26285959e+01 -5.51745211e+00 -5.08479878e+00 6.43372321e+01
1716.lowfreq: -14.9900 -2.6977 -0.0005 -0.0004 -0.0003 4.8076 45.8748 90.5435 107.3429
frequency: 45.8354 90.3710 107.2881 127.2638 168.5544 199.8321 237.7547 309.4398 330.0685 394.3972 451.1025 468.4727 582.1695 697.6528 780.2697 806.0591 857.2979 901.3521 967.1766 993.2153 998.2687 1039.5307 1052.3087 1091.9201 1127.0771 1145.6470 1168.0831 1211.5263 1221.6582 1247.6546 1276.9494 1309.1759 1325.9255 1381.5824 1393.0998 1415.1519 1470.3410 1479.1684 1486.3227 1603.5022 1644.2501 2866.7054 2984.2946 2995.6322 3044.2457 3069.0227 3082.8766 3087.8800 3093.4105 3106.6196 3130.2215
redmass: 4.1415 2.7901 3.4663 2.0838 3.4227 1.4967 2.1030 2.6189 5.8218 3.2289 3.5568 3.4514 4.2942 4.0315 1.7413 2.2612 1.7911 1.8208 1.5077 1.3062 1.4504 2.2093 1.2607 2.0465 2.2447 2.2892 2.6338 1.2869 1.4120 1.2445 1.4280 1.2926 1.3515 1.2850 1.2552 2.2577 1.0642 1.0407 1.0771 7.7233 5.5555 1.0852 1.0358 1.0608 1.0988 1.0926 1.1003 1.0995 1.0910 1.0899 1.0919
irintensity: 2.1797 2.1881 7.7125 5.9502 5.0279 1.9442 4.6591 1.1794 0.1753 1.1862 10.0004 5.7816 24.7199 8.1312 15.1299 56.4024 8.2292 5.0584 16.7315 35.6280 4.9916 3.8921 19.5884 45.6595 45.0305 1.2484 21.5726 2.7990 3.9430 0.4340 0.0632 19.1930 1.0342 2.3093 9.9827 24.5134 5.9372 13.6507 15.6362 159.6765 201.4755 107.9764 26.2189 23.6381 1.1565 6.5981 63.7000 41.6076 0.0218 26.8502 9.7144
temp: 298.150 k
press: 1.00000 atm
elementType: 8 8 6 6 6 6 6 6 6 1 1 1 1 1 1 1 1 1 1
symmnumber: 1
zpe: 401141.5 jmol-1
zpe.correction: 0.152787 hartree
zpe.thermalcorrener: 0.162867 hartree
zpe.thermalcorrenthalpy: 0.163811 hartree
zpe.thermalcorrgfe: 0.116585 hartree
zpe.sumelectzpe: -422.420439 hartree
zpe.sumelectthermal: -422.410359 hartree
zpe.sumelectthermalent: -422.409415 hartree
zpe.sumelectthermalfe: -422.456641 hartree
dipole: -4.4028 1.1799 1.0107
dipole: 4.6689
quadrupole: -70.7207 -61.1621 -49.4520
quadrupole: -8.6470 2.3178 -1.7380
quadrupole: -10.2758 -0.7172 10.9929 -8.6470 2.3178 -1.7380
hfenergy: -422.5732259 hartree
pointgroup: C01 [X(C7H10O2)]
dipole: -1.6317348 -0.6908511 -0.4840033 debye
dipolederiv: -0.5759055 -0.0171628 0.0339575 0.2191234 -0.694589 -0.0000963 0.1653442 -0.0287512 -0.2853537 -1.2023574 0.0912258 -0.0977219 0.1871768 -0.3820654 0.0561788 -0.210469 0.0619571 -0.4529757 0.5779109 0.1261786 -0.0199947 -0.0125601 0.3458282 0.0376828 0.2311257 -0.0437623 0.3227714 -0.186411 -0.0094783 -0.0455749 -0.1737549 0.2049471 -0.0640438 -0.3314315 0.0211707 0.1943849 -0.0211634 -0.0672661 0.0479369 0.0391427 0.0100275 -0.0111351 -0.0978474 -0.0030039 0.0716796 0.7331097 -0.0268966 0.0474794 -0.1354818 -0.129015 -0.0874406 0.0621332 -0.1127674 0.0481496 -0.0112655 -0.0419036 -0.0021692 0.0089638 -0.0200277 -0.008193 0.0572974 0.0149927 0.0876723 -1.083762 0.0381052 -0.0200548 0.0460262 -0.1193871 -0.0564081 0.1909305 -0.0696809 0.0258256 1.6839999 -0.1493928 0.0983209 -0.0546417 0.2271274 -0.2113692 -0.2977339 -0.1939702 0.6004771 0.0225209 -0.0457982 0.0499794 -0.058418 0.051149 -0.032484 0.0338601 -0.0400001 -0.128975 0.0121792 0.0232367 0.0065291 0.0268048 0.0728018 0.0741151 0.0555069 0.0763601 -0.0677941 -0.1484212 0.0512085 -0.0770446 0.0307756 0.0005382 0.0364543 -0.0578154 0.0665365 0.0537063 0.0922179 -0.022497 -0.0144192 -0.0138133 0.0314551 -0.0514647 0.046937 -0.0511743 -0.1307409 0.060243 0.0013994 0.0134492 -0.0343515 0.1281374 0.0724766 0.0338021 0.0793107 -0.0411194 0.1080052 0.0214381 0.0363447 0.0140823 0.0575299 -0.0169894 0.0103416 -0.0759936 -0.1580957 -0.0440193 0.1111576 -0.0932038 0.0716784 0.0269855 0.0221357 -0.0998447 0.048213 0.034387 -0.1010033 -0.1213125 0.0646785 -0.1317941 -0.0046491 0.0190315 0.0741599 0.0382125 0.0789235 0.0536344 -0.000027 0.0363087 -0.0076917 0.1432309 0.0793481 0.0601504 0.0770953 -0.0351 0.0304876 0.0377851 -0.0648013 -0.0212669 0.0499753 0.1422014 0.0735531 0.1352554 -0.2178228 unknown
polarizability: 144.2250594|-2.1250015|60.4519478|10.7631864|-4.4044612|65.4176851 unknown
InChI: InChI=1S/C7H10O2/c1-2-6-7(9-6)4-3-5-8/h3-7H,2H2,1H3
charge 0 multiplicity 1
19 atoms
O  -1.445677 1.599519 0.108324
O  4.385256 -0.097461 0.483519
C  -1.721418 0.218621 -0.420952
C  -0.517001 0.436072 0.466713
C  -2.96024 -0.488518 0.096193
C  0.843913 0.527906 -0.09119
C  -2.903528 -2.011551 -0.168305
C  1.978936 0.142794 0.569051
C  3.304195 0.252807 -0.064942
H  -1.53388 0.131709 -1.502579
H  -0.607328 0.119968 1.514472
H  -3.850513 -0.051204 -0.39591
H  -3.066012 -0.286371 1.17851
H  0.918669 0.944462 -1.107718
H  -2.806276 -2.230168 -1.247836
H  -2.045356 -2.477203 0.349665
H  -3.82418 -2.503597 0.191387
H  1.947567 -0.261161 1.58941
H  3.296175 0.683373 -1.09981
