program: Gaussian 09
title: 000182212
version: EM64L-G09RevD.01
frameworkgroup: C1[X(C16H22N4O6)]
method: RPBEPBE
basis: SDD
operation: Freq
keyword: #p
keyword: freq=noraman
keyword: PBEPBE/SDD
title: #p freq=noraman PBEPBE/SDD
converged: YES YES NO NO
title: Mulliken charges:
elementType: O O O O O O N N N N C C C C C C C C C C C C C C C C H H H H H H H H H H H H H H H H H H H H H H
charge: -0.177012 -0.304875 -0.285911 -0.295976 -0.153045 -0.139196 -0.385850 -0.092381 -0.063839 0.199064 -0.360455 -0.346543 -0.416864 -0.390226 0.144768 0.400451 -0.301747 -0.035607 -0.556786 0.159555 0.197015 0.035693 -0.419307 -0.510973 -0.524597 -0.516613 0.204044 0.194831 0.211262 0.208782 0.262447 0.223255 0.219402 0.218229 0.309611 0.238221 0.236781 0.220419 0.242537 0.222754 0.284043 0.212109 0.229599 0.270211 0.212487 0.226520 0.221139 0.272576
chargesum: 0.00000
title: Mulliken charges with hydrogens summed into heavy atoms:
elementType: O O O O O O N N N N C C C C C C C C C C C C C C C C
charge: -0.177012 -0.304875 -0.285911 -0.295976 -0.153045 -0.139196 -0.076239 -0.092381 -0.063839 0.199064 0.038419 0.073501 0.068838 0.047405 0.144768 0.400451 0.173256 -0.035607 -0.336368 0.159555 0.197015 0.035693 -0.176770 0.207933 0.187701 0.203621
polarizability: 2.98660932e+02 -3.91315253e+01 2.31890185e+02 3.18781106e+01 2.29231054e+01 2.19079001e+02
1716.lowfreq: -0.0008 -0.0007 -0.0005 2.8468 6.2395 11.9286 12.7331 17.0759 22.7931
frequency: 11.6529 14.8192 22.5161 37.4472 44.3895 60.2281 69.3132 72.0155 87.0676 88.4696 95.5659 101.4364 117.2871 131.7879 133.7595 148.0646 159.3865 162.4657 175.8150 182.2555 199.2897 207.4779 223.5063 232.2291 264.8969 296.1608 303.2074 316.5341 334.8117 353.8853 365.6892 387.8067 420.1404 438.1140 462.8534 484.0469 509.9152 529.9204 539.8250 562.3610 589.5459 617.1529 624.5830 644.1765 660.6318 662.8280 684.9514 741.4371 756.6841 757.4911 793.7714 800.7255 812.2314 842.8442 852.3439 859.4142 881.8637 905.3518 915.3876 927.1312 934.6887 957.8097 982.9696 1016.6296 1049.1996 1054.0438 1078.7948 1092.7659 1100.8996 1109.0805 1110.8424 1111.4104 1121.6177 1144.5037 1153.8277 1156.3862 1159.1879 1164.3326 1172.1075 1202.9326 1222.5224 1239.9148 1249.2403 1277.7653 1283.9906 1292.8096 1297.5265 1321.0276 1329.2932 1347.9624 1354.4852 1362.2035 1364.9344 1385.3606 1397.2665 1404.1420 1421.2770 1427.1217 1433.3520 1450.9392 1452.8078 1455.5844 1456.8159 1459.1070 1465.9479 1467.6132 1473.3093 1485.3073 1486.1899 1488.0917 1490.0466 1503.3406 1512.4685 1538.6898 1552.8287 1602.0285 2961.6204 2976.3354 2981.3164 2982.6519 2985.3164 2992.3833 2996.0703 3005.1611 3012.0212 3036.6175 3057.3724 3082.7372 3084.2927 3087.0472 3094.3984 3095.1175 3132.0767 3132.7943 3134.8622 3146.2661 3147.3341 3579.7387
redmass: 7.6285 6.0411 7.2207 5.3663 5.1358 2.9059 3.9915 3.1393 2.4121 2.7065 2.2416 2.4799 1.9903 1.9964 2.3662 1.5019 1.5868 3.3130 2.9549 2.8847 4.4242 3.8080 3.9182 5.0747 4.6202 6.5728 3.4443 5.3385 3.9293 4.1037 4.5168 4.4034 6.0590 6.3904 1.7402 3.1262 4.5693 3.9607 3.7531 3.7381 4.8157 6.6887 7.1886 13.5209 5.9945 6.3985 5.1938 1.1212 8.7570 14.4171 1.3741 2.8315 4.1285 3.3377 4.1545 3.9181 1.8023 3.6644 4.8536 6.3001 1.4366 4.5000 2.1513 5.3489 2.9164 3.1339 4.5803 2.9813 2.4972 1.2375 1.2669 1.2639 2.9209 1.6301 1.4431 1.3832 1.4680 9.4868 1.6664 4.5651 1.5112 1.3316 1.7364 1.2671 1.2432 1.1943 3.4079 2.4787 1.5193 2.4754 1.4033 1.3967 1.5808 3.2711 1.7677 1.6667 1.3516 1.6003 1.3094 1.1279 1.3080 1.1037 1.0913 1.0996 1.7626 1.0955 1.1195 1.0568 1.0555 1.1058 1.0694 4.9992 12.3420 5.7765 3.4339 6.4845 1.0601 1.0346 1.0326 1.0596 1.0322 1.0668 1.0594 1.0556 1.0974 1.1025 1.1054 1.1066 1.0996 1.0973 1.0994 1.1001 1.1051 1.1053 1.1060 1.0915 1.0903 1.0762
irintensity: 0.4353 0.2515 0.4415 1.8596 1.0924 3.1380 4.4674 0.4679 4.0813 4.6088 3.8939 0.5486 0.9936 0.1762 3.9740 2.3288 2.4999 2.3915 3.2150 7.8208 3.3976 0.8995 8.7226 3.6782 1.6028 4.7378 4.5870 6.3394 1.7868 3.4466 5.1749 1.5103 12.7422 7.0495 40.0296 31.0372 15.6196 19.6960 13.9028 4.1522 10.8990 10.4780 18.6482 6.8475 11.9880 2.9777 4.4536 13.5198 12.4274 213.5028 8.1325 17.9652 9.6135 23.4645 21.2158 3.1070 13.7993 4.4351 47.1164 18.8746 8.9079 48.6588 40.3571 98.6116 7.3558 11.7700 209.0534 9.0070 10.0143 19.7232 17.2169 8.2216 23.2409 13.5681 4.6258 12.8768 23.4910 261.7008 6.9664 28.9591 77.7886 9.2352 23.2725 1.9031 2.6710 2.0865 20.8782 52.8236 41.9142 11.5145 88.7906 19.4980 52.2474 72.2531 119.9244 18.2144 26.0682 175.0244 9.9709 39.1254 16.3246 27.5964 20.3624 20.4448 85.5643 8.7024 11.9850 5.6240 34.7502 10.1603 50.7876 169.1029 252.0051 2.3431 423.2177 80.0102 27.2589 90.7304 100.5524 13.6882 82.9073 57.0985 29.7759 37.9037 28.0082 15.6190 19.9224 37.3915 34.3937 31.8841 49.5582 19.8459 11.2300 15.3150 5.3332 27.9866 3.7067 29.1167
temp: 298.150 k
press: 1.00000 atm
elementType: 8 8 8 8 8 8 7 7 7 7 6 6 6 6 6 6 6 6 6 6 6 6 6 6 6 6 1 1 1 1 1 1 1 1 1 1 1 1 1 1 1 1 1 1 1 1 1 1
symmnumber: 1
zpe: 986978.0 jmol-1
zpe.correction: 0.375920 hartree
zpe.thermalcorrener: 0.403520 hartree
zpe.thermalcorrenthalpy: 0.404464 hartree
zpe.thermalcorrgfe: 0.313472 hartree
zpe.sumelectzpe: -1291.110783 hartree
zpe.sumelectthermal: -1291.083183 hartree
zpe.sumelectthermalent: -1291.082239 hartree
zpe.sumelectthermalfe: -1291.173232 hartree
dipole: 2.8927 2.6734 1.0099
dipole: 4.0663
quadrupole: -179.5100 -146.2869 -152.6644
quadrupole: -21.9864 16.1018 3.1189
quadrupole: -20.0229 13.2002 6.8227 -21.9864 16.1018 3.1189
hfenergy: -1291.4867034 hartree
pointgroup: C01 [X(C16H22N4O6)]
dipole: -0.886832 0.2301586 1.3114416 debye
polarizability: 277.8977676|-60.8351814|233.1182021|18.6886259|15.8838216|238.6141486 unknown
InChI: InChI=1S/C16H22N4O6/c1-23-12-9-11-13(15(25-3)14(12)24-2)18-10-19-16(11)17-7-5-4-6-8-26-20(21)22/h9-10,17H,4-8H2,1-3H3
charge 0 multiplicity 1
48 atoms
O  6.325156 -0.618063 -1.360794
O  -4.085837 0.927262 -1.709016
O  -2.62012 2.595773 2.634032
O  -4.293789 2.796207 0.346804
O  5.88101 -0.08636 -3.636096
O  7.993332 0.148775 -2.767916
N  0.398534 -1.543068 1.813461
N  -0.399568 -2.360621 -0.236281
N  -2.165746 -1.243853 -1.496081
N  6.768922 -0.138892 -2.727468
C  2.824563 -2.246538 1.761884
C  3.122904 -1.794034 0.315919
C  1.348057 -2.657249 1.980914
C  4.608108 -1.404359 0.123583
C  -0.458955 -1.41558 0.742369
C  -1.402918 -0.3026 0.671111
C  4.872497 -0.959655 -1.319745
C  -2.241156 -0.262351 -0.504188
C  -1.532658 0.695737 1.673825
C  -3.198634 0.807369 -0.635871
C  -2.490815 1.709459 1.553741
C  -3.354317 1.756263 0.404819
C  -1.26481 -2.220383 -1.294003
C  -3.564895 0.804823 -3.09284
C  -2.542495 4.046032 2.340744
C  -5.71704 2.407818 0.190957
H  3.459057 -3.11974 2.017787
H  3.100727 -1.439447 2.472274
H  2.848086 -2.608395 -0.382958
H  2.472198 -0.934612 0.060485
H  1.056886 -3.429718 1.25007
H  1.225542 -3.076148 2.998856
H  5.260071 -2.264753 0.366746
H  4.877412 -0.583293 0.814956
H  0.36567 -0.833464 2.544476
H  4.666821 -1.766463 -2.046818
H  4.280126 -0.067727 -1.594546
H  -0.924199 0.710468 2.583942
H  -1.203441 -3.002826 -2.057696
H  -4.441062 0.988897 -3.733282
H  -3.146101 -0.200198 -3.248978
H  -2.795954 1.579784 -3.272745
H  -2.700087 4.539489 3.311607
H  -3.320111 4.340936 1.618711
H  -1.537949 4.297936 1.94894
H  -6.270682 3.3589 0.190139
H  -6.032228 1.786107 1.049671
H  -5.864808 1.864354 -0.755296
