program: Gaussian 09
title: 000017509
version: EM64L-G09RevD.01
frameworkgroup: C1[X(C12H10F17NO6S2)]
method: RPBEPBE
basis: SDD
operation: Freq
keyword: #p
keyword: freq=noraman
keyword: PBEPBE/SDD
title: #p freq=noraman PBEPBE/SDD
converged: YES YES NO NO
title: Mulliken charges:
elementType: S S F F F F F F F F F F F F F F F F F O O O O O O N C C C C C C C C C C C C H H H H H H H H H H
charge: 1.016840 1.185780 -0.107912 -0.123048 -0.125648 -0.119448 -0.116461 -0.119067 -0.139125 -0.109903 -0.118994 -0.114768 -0.122668 -0.117982 -0.118217 -0.128344 -0.124581 -0.119209 -0.120355 -0.492646 -0.476366 -0.397759 -0.534038 -0.464627 -0.465062 -0.349762 0.247835 0.258245 0.203730 0.132699 0.266997 0.228426 -0.374676 0.221373 -0.318842 -0.215446 0.381265 -0.645522 0.267991 0.261649 0.257771 0.231917 0.261652 0.252822 0.253079 0.240344 0.218416 0.391644
chargesum: 0.00000
title: Mulliken charges with hydrogens summed into heavy atoms:
elementType: S S F F F F F F F F F F F F F F F F F O O O O O O N C C C C C C C C C C C C
charge: 1.016840 1.185780 -0.107912 -0.123048 -0.125648 -0.119448 -0.116461 -0.119067 -0.139125 -0.109903 -0.118994 -0.114768 -0.122668 -0.117982 -0.118217 -0.128344 -0.124581 -0.119209 -0.120355 -0.492646 -0.476366 -0.397759 -0.142394 -0.464627 -0.465062 -0.349762 0.247835 0.258245 0.203730 0.132699 0.266997 0.228426 0.154965 0.221373 0.170845 0.299029 0.381265 0.066317
polarizability: 3.20170060e+02 3.18552875e+01 2.08104991e+02 6.08972850e+00 -3.58819644e+00 2.00019313e+02
1716.lowfreq: -11.1879 -1.7198 -0.0010 -0.0009 -0.0006 2.1823 5.6705 7.0650 9.1724
frequency: -5.0400 5.8887 9.1143 12.6287 19.6987 25.3787 32.2270 38.2624 41.1327 47.9849 53.3294 57.4390 65.2059 68.3924 73.8364 79.6983 88.6455 112.3428 116.9890 125.3706 132.9761 138.1752 141.3784 154.6845 169.1531 172.1767 178.0636 187.0780 192.6466 196.7166 209.1111 209.8289 218.2353 224.0510 232.9180 234.1763 235.4882 246.8416 256.5417 262.6047 269.5899 276.6729 281.6333 283.2128 287.1786 299.4026 307.9861 317.7697 320.4949 330.0701 331.0478 335.2862 340.4149 345.4806 352.8777 367.7670 392.4466 401.2383 410.6208 423.2341 429.6149 455.8461 456.0472 467.5059 492.2968 499.9722 519.2730 524.5959 538.6431 547.1747 553.3287 566.0222 570.6898 577.3019 604.3962 632.4629 644.4353 675.5192 749.3436 771.1510 793.3359 823.1159 835.2637 852.7058 862.7922 918.3679 930.9254 970.3595 971.9263 978.2717 987.2489 989.1649 1011.0531 1012.0067 1015.3523 1022.7456 1027.3237 1033.9852 1035.8311 1045.1319 1052.3727 1057.2940 1061.5715 1067.3671 1074.5509 1085.7070 1093.1876 1102.2769 1116.3162 1138.0414 1142.3566 1166.1378 1169.9648 1176.4641 1199.7050 1209.2707 1214.3210 1290.1510 1314.8261 1349.1812 1352.7418 1360.8848 1395.5698 1426.4225 1458.7444 1463.7984 1466.7474 1480.5865 2966.8481 2994.7865 2997.8269 3014.7946 3052.7844 3065.4219 3097.4317 3097.9011 3117.0795 3463.2603
redmass: 4.6684 14.0748 10.8242 7.7427 9.9733 11.3876 12.6421 9.9662 5.0119 17.1392 13.1388 8.4634 12.4475 16.8573 3.4015 10.5195 15.4991 2.0302 9.0839 15.3682 4.5847 5.7278 4.4954 14.3853 3.0766 15.3072 15.9988 16.4567 17.5538 2.9103 7.0349 11.4940 5.3926 16.7539 5.0091 9.0929 7.5507 16.3257 6.5606 18.0089 3.0127 15.9428 18.1120 16.8359 4.4683 16.5561 5.9156 17.7213 18.2765 3.6235 18.0284 18.6284 18.5004 6.7252 6.7581 17.3719 11.7912 7.3723 14.7972 17.5221 4.3403 4.3591 14.5501 17.0012 17.3887 16.3715 6.0693 6.6667 17.2399 11.8272 17.0032 9.7850 17.2788 8.3422 16.8055 16.3889 17.3687 16.0021 3.1104 7.1747 1.4588 13.4143 15.0339 2.8384 10.7515 13.1250 2.0589 12.2891 4.9953 7.9101 3.7964 9.9336 5.9399 3.2156 12.9170 13.0594 13.0496 12.9200 13.4506 11.5001 2.8941 7.6884 13.0792 9.9580 2.4948 13.4188 12.5607 1.2966 12.5186 11.0172 2.2391 10.8583 2.2825 12.2422 11.9240 1.1999 12.2525 1.1711 1.1606 1.2011 1.2318 1.2352 1.1885 1.0888 1.0438 1.0693 1.0673 1.0623 1.0634 1.0594 1.0362 1.0577 1.0985 1.1019 1.1001 1.1068 1.1018 1.0662
irintensity: 0.4183 0.5510 0.3984 0.1167 0.3141 0.0044 0.0144 0.9906 1.5733 0.0271 0.5449 7.9769 0.7276 0.2050 3.1185 0.7176 1.3072 54.2649 11.5757 2.1974 5.5005 9.7655 18.9619 0.4984 5.0371 0.7911 0.3347 2.0871 6.0614 4.1182 15.8351 2.0879 2.0080 0.1549 3.4561 0.7228 5.1002 0.6250 3.1766 4.2418 38.0121 1.8578 2.2308 1.6363 7.9834 0.8071 7.4708 1.8241 0.2642 4.6539 0.0468 1.1547 0.0579 16.7488 44.5219 3.6051 70.5543 13.8750 17.7385 13.7505 46.9273 19.6789 39.1458 6.6374 6.8827 56.8540 17.7154 43.9536 7.5424 57.7020 16.8363 113.0774 7.7162 120.6231 56.7742 93.4634 35.5225 55.2899 29.0320 39.3092 12.8216 25.0787 30.9616 64.7909 82.1823 83.0826 10.2508 33.8148 21.6205 16.2731 101.9327 31.5312 39.7209 10.9806 12.2189 8.3081 30.2190 14.8370 37.2199 9.5161 10.3601 84.0994 82.0614 444.2087 31.2464 541.6591 30.7071 64.9507 51.8143 134.5523 38.2345 116.8870 62.1714 26.2806 1.2933 2.5748 26.9650 25.0121 1.5585 16.5012 2.1120 6.7292 7.7442 20.5358 11.1718 35.3273 4.4852 28.7819 27.4293 8.2595 19.7580 10.4845 1.1293 1.3452 19.5843 9.0950 15.6965 82.1964
temp: 298.150 k
press: 1.00000 atm
elementType: 16 16 9 9 9 9 9 9 9 9 9 9 9 9 9 9 9 9 9 8 8 8 8 8 8 7 6 6 6 6 6 6 6 6 6 6 6 6 1 1 1 1 1 1 1 1 1 1
symmnumber: 1
zpe: 642921.4 jmol-1
zpe.correction: 0.244876 hartree
zpe.thermalcorrener: 0.287441 hartree
zpe.thermalcorrenthalpy: 0.288386 hartree
zpe.thermalcorrgfe: 0.162586 hartree
zpe.sumelectzpe: -3459.342968 hartree
zpe.sumelectthermal: -3459.300402 hartree
zpe.sumelectthermalent: -3459.299458 hartree
zpe.sumelectthermalfe: -3459.425257 hartree
dipole: -3.3444 0.8931 4.2853
dipole: 5.5088
quadrupole: -213.7045 -241.9015 -236.3967
quadrupole: -1.8342 -22.3419 -3.3512
quadrupole: 16.9630 -11.2339 -5.7291 -1.8342 -22.3419 -3.3512
hfenergy: -3459.5878435 hartree
pointgroup: C01 [X(C12H10F17N1O6S2)]
dipole: 1.304868 -0.3534113 1.6940343 debye
polarizability: 316.4742498|37.9612776|211.6104177|-2.6477716|4.4010243|200.2096973 unknown
InChI: InChI=1S/C8F17.C4H10NO6S2/c9-1(10)2(11,12)3(13,14)4(15,16)5(17,18)6(19,20)7(21,22)8(23,24)25;1-2-5(12(6)7)3-4-11-13(8,9)10/h;8H,2-4H2,1H3
charge 0 multiplicity 1
48 atoms
S  2.211146 0.42439 -0.11192
S  8.296457 1.475834 -0.645076
F  -0.482889 -0.590399 -1.606441
F  -1.574694 -2.591345 -1.364127
F  -0.223136 -3.173673 0.950324
F  1.083199 -2.721357 -0.862222
F  -2.293814 -1.482229 1.400555
F  -1.684511 0.516021 0.464895
F  2.193468 -1.903316 1.517166
F  0.429202 -0.52572 1.956715
F  -4.148817 -1.973944 -0.442644
F  -3.294596 -0.447759 -1.923724
F  -4.365876 0.414902 1.425561
F  -4.079592 1.646042 -0.481257
F  -6.539079 -0.806323 0.519985
F  -6.105431 -0.302396 -1.670166
F  -6.663115 2.12028 0.985091
F  -8.246382 1.097563 -0.282025
F  -6.645082 2.348344 -1.278748
O  2.580452 -0.105592 -1.59505
O  1.330908 1.74322 0.184421
O  6.739423 0.991362 0.204281
O  9.336037 0.954375 0.764569
O  8.412648 3.070228 -0.786723
O  8.53469 0.504415 -1.901352
N  3.77894 0.559033 0.785973
C  -0.984506 -1.51419 -0.662314
C  0.24964 -2.121277 0.113819
C  -2.114237 -0.798842 0.178219
C  1.14214 -1.162104 0.935253
C  -3.511639 -0.717889 -0.555514
C  -4.482546 0.387433 0.017662
C  4.805808 -0.424862 0.379479
C  -6.002669 0.170634 -0.34229
C  3.682164 1.05643 2.186385
C  5.839249 0.13376 -0.614178
C  -6.898042 1.462562 -0.22967
C  4.796643 2.075946 2.487241
H  4.333013 -1.29167 -0.121666
H  5.316982 -0.798801 1.285241
H  2.698666 1.54869 2.297047
H  3.725141 0.203063 2.893982
H  5.348797 0.723921 -1.406591
H  6.416373 -0.698132 -1.058852
H  5.799261 1.641642 2.342744
H  4.707592 2.954315 1.827395
H  4.702152 2.406306 3.538035
H  10.079761 1.62311 0.842013
