program: Gaussian 09
title: 000196075
version: EM64L-G09RevD.01
frameworkgroup: C1[X(C9H8O4)]
method: RPBEPBE
basis: SDD
operation: Freq
keyword: #p
keyword: freq=noraman
keyword: PBEPBE/SDD
title: #p freq=noraman PBEPBE/SDD
converged: NO NO NO NO
title: Mulliken charges:
elementType: O O O O C C C C C C C C C H H H H H H H H
charge: -0.220635 -0.343828 -0.420079 -0.238577 0.335073 -0.027010 -0.419631 0.159290 -0.396798 0.186031 0.096528 -0.329587 -0.488431 0.244210 0.244210 0.246448 0.259652 0.222294 0.252793 0.251901 0.386147
chargesum: 0.00000
title: Mulliken charges with hydrogens summed into heavy atoms:
elementType: O O O O C C C C C C C C C
charge: -0.220635 -0.343828 -0.033932 -0.238577 0.335073 -0.027010 0.068789 0.159290 -0.150351 0.186031 0.096528 -0.069935 0.238557
polarizability: 1.34151009e+02 -5.34465131e+00 1.42913623e+02 2.29249763e-02 -1.77366421e-02 5.21394590e+01
1716.lowfreq: -51.9197 -7.8904 -0.0006 0.0003 0.0005 7.5406 9.1614 102.1820 124.7190
frequency: -51.8772 102.1633 124.7182 176.3130 196.7064 217.5528 240.3268 245.1084 309.9715 328.6744 439.7644 459.6277 473.0956 529.4370 531.5505 567.4492 568.3530 594.0528 682.8994 688.4254 727.4115 743.2773 819.8665 875.4719 920.5019 938.8115 965.0106 998.9376 1022.1687 1037.2553 1112.5211 1138.7511 1140.8088 1159.0116 1188.3742 1210.1894 1247.1584 1291.8871 1313.6821 1421.8028 1431.9583 1440.5502 1452.1997 1457.8517 1463.7030 1485.8431 1599.8866 1623.0882 1677.7520 3007.8275 3013.4725 3064.2025 3132.7281 3137.8281 3147.2312 3177.9666 3490.4241
redmass: 3.2797 5.3012 6.4102 1.1349 3.1737 3.6201 4.4054 7.5892 5.3328 4.6213 6.8909 6.6519 4.3552 6.9630 1.1788 4.4578 3.6601 8.0682 9.1132 6.8891 7.2883 6.3354 1.3570 8.0891 6.3212 1.3464 10.9681 1.7214 5.0127 4.4529 1.2505 1.0749 1.5774 1.3215 1.6031 3.5018 2.5468 3.0155 1.5114 3.0763 3.3316 1.3481 1.2103 1.0476 1.1209 2.9123 7.9836 6.8196 12.3194 1.0573 1.0281 1.1073 1.1059 1.1065 1.0902 1.0958 1.0637
irintensity: 12.1217 0.3212 0.0237 0.1020 6.0661 2.2107 0.7983 8.1082 7.5292 1.4195 0.9403 4.5137 15.2374 5.7261 119.9901 6.3182 31.0700 13.5663 4.8824 0.0011 16.4598 1.1647 38.6219 126.7890 5.1979 0.4034 54.5784 0.9017 75.2587 64.6587 0.0363 0.3341 0.0009 13.0354 109.3271 225.1102 26.7965 118.5398 18.5530 36.3802 136.1380 29.3282 14.5373 16.6666 9.5734 117.8642 3.5476 21.4227 402.3143 33.2341 44.1022 10.9936 20.9351 19.5588 7.4063 4.8440 80.9856
temp: 298.150 k
press: 1.00000 atm
elementType: 8 8 8 8 6 6 6 6 6 6 6 6 6 1 1 1 1 1 1 1 1
symmnumber: 1
zpe: 404060.3 jmol-1
zpe.correction: 0.153898 hartree
zpe.thermalcorrener: 0.164350 hartree
zpe.thermalcorrenthalpy: 0.165294 hartree
zpe.thermalcorrgfe: 0.118128 hartree
zpe.sumelectzpe: -647.697455 hartree
zpe.sumelectthermal: -647.687004 hartree
zpe.sumelectthermalent: -647.686060 hartree
zpe.sumelectthermalfe: -647.733226 hartree
dipole: -1.3163 -1.8009 0.0076
dipole: 2.2307
quadrupole: -84.3990 -64.4955 -75.2803
quadrupole: -16.0185 0.0183 0.0196
quadrupole: -9.6741 10.2294 -0.5554 -16.0185 0.0183 0.0196
hfenergy: -647.8513537 hartree
pointgroup: C01 [X(C9H8O4)]
dipole: -0.4775268 -0.7219565 0.1447001 debye
dipolederiv: -0.8556496 0.3564178 0.0034636 0.1808201 -0.7279622 0.0418851 0.0275026 0.0256564 -0.3022687 -0.5026056 0.3807873 -0.0326505 0.4426853 -1.5641695 0.1272078 -0.0419814 0.1349723 -0.3183311 -1.3826075 0.1893434 0.0646875 0.2565211 -0.2027216 -0.0507308 0.0557286 -0.0445389 -0.3995173 -0.5979636 -0.0843563 0.0378726 -0.1431854 -1.2453203 0.1392309 0.0454739 0.1347084 -0.3398914 0.0336992 -0.1370001 0.007955 0.2873477 -0.0377206 -0.0324104 -0.0496885 0.0071777 -0.0755649 -0.474678 -0.1853317 0.0672228 -0.384753 -0.4093017 0.0878453 0.0937265 0.0693338 -0.0429126 0.1777184 0.089596 0.0036651 -0.0389085 0.4069396 -0.0045354 0.0213411 -0.0166479 0.3473917 0.1927273 -0.3355373 0.0351544 -0.732039 1.1615641 -0.075037 0.0899228 -0.1129036 0.1043937 -0.190112 0.1294445 -0.0154874 -0.1824642 0.0965085 -0.0193985 0.0264553 -0.0482298 -0.1680975 1.4373889 -0.0479201 -0.102757 0.2282803 1.7542644 -0.2240091 -0.1404563 -0.1987518 0.302507 1.2917077 -0.3009427 -0.0745649 -0.0948961 -0.3818278 0.0649311 -0.101843 0.0839829 0.0351308 0.0132153 -0.1501264 0.0057392 0.1737424 0.1472829 -0.0548167 -0.0380815 -0.025071 -0.1350838 0.1906842 0.1742734 -0.0134297 -0.0967496 0.8646658 -0.0669471 0.0228848 -0.0918674 0.2996079 -0.0033786 0.0133341 -0.0576074 0.0216029 0.011183 0.0440673 -0.106098 0.0838936 -0.0189716 0.0250419 0.0115075 0.0491752 0.0394628 -0.0254849 -0.0520777 0.0927619 -0.0885234 -0.0108885 0.0614356 0.0812913 -0.001212 0.0516256 -0.0590373 0.0257894 0.0028602 0.0229725 0.1637256 0.0309484 -0.0785689 0.0231263 -0.0716788 0.0309201 0.024908 0.0220229 0.0255209 0.1611857 -0.07015 0.1613558 -0.0046624 0.0800283 -0.0478546 0.0153989 0.0064179 0.007894 0.1199191 0.0970683 -0.1167321 0.0918206 0.0258082 0.0028543 -0.0388426 0.0630606 0.0104745 -0.059677 0.0658712 -0.1406906 -0.0815899 0.0105784 0.0072718 0.0206308 -0.0917514 -0.0029678 -0.0372921 0.4596384 -0.0101449 -0.0059211 -0.0538285 0.2179461 0.0269109 -0.000259 0.0229146 0.3746349 unknown
polarizability: 134.0482102|-6.7056193|140.8656033|-6.679535|-11.3537259|54.2902775 unknown
InChI: InChI=1S/C9H8O4/c1-12-8-6(10)3-2-5-4-13-9(11)7(5)8/h2-3,10H,4H2,1H3
charge 0 multiplicity 1
21 atoms
O  2.701926 0.126577 -0.478772
O  -1.790321 1.456594 -0.240848
O  -3.281701 -0.618967 0.175692
O  1.623261 2.168055 -0.656766
C  0.835916 -1.297488 -0.112159
C  0.354141 0.038024 -0.248146
C  2.342378 -1.294628 -0.25278
C  -1.041336 0.280008 -0.151462
C  -0.015127 -2.385815 0.11372
C  1.528701 0.938121 -0.47974
C  -1.909225 -0.839602 0.079527
C  -1.407478 -2.146073 0.209795
C  -1.204733 2.791588 -0.471388
H  2.870257 -1.631396 0.657298
H  2.704244 -1.872197 -1.122136
H  0.376219 -3.403108 0.214899
H  -2.118528 -2.958255 0.384876
H  -2.074309 3.466299 -0.484896
H  -0.667722 2.820152 -1.431793
H  -0.511328 3.057681 0.341056
H  -3.440837 0.356632 0.057224
