program: Gaussian 09
title: 000182202
version: EM64L-G09RevD.01
frameworkgroup: C1[X(C10H11NO2)]
method: RPBEPBE
basis: SDD
operation: Freq
keyword: #p
keyword: freq=noraman
keyword: PBEPBE/SDD
title: #p freq=noraman PBEPBE/SDD
converged: YES YES NO NO
title: Mulliken charges:
elementType: O O N C C C C C C C C C C H H H H H H H H H H H
charge: -0.255159 -0.443964 -0.214511 -0.518909 0.238295 -0.491763 0.287729 0.144264 0.140883 -0.385922 -0.657045 -0.426576 -0.211050 0.267529 0.231266 0.250396 0.240094 0.248892 0.229064 0.235999 0.282987 0.221522 0.226451 0.359530
chargesum: 0.00000
title: Mulliken charges with hydrogens summed into heavy atoms:
elementType: O O N C C C C C C C C C C
charge: -0.255159 -0.084434 -0.214511 -0.020114 0.238295 -0.001273 0.287729 0.144264 0.140883 -0.137031 0.091004 -0.205054 0.015401
polarizability: 1.65833143e+02 6.70581472e+00 1.31287248e+02 -1.61379211e+00 -2.34391464e+00 6.29377013e+01
1716.lowfreq: -17.2558 -7.4426 -7.1764 -0.0007 -0.0004 -0.0003 80.3909 88.9613 167.1528
frequency: 80.3748 88.9572 167.1521 188.1246 209.6523 245.7401 263.2557 324.8198 344.3480 360.4714 391.6140 417.0625 446.6147 490.8249 529.1009 546.2392 570.1213 606.9722 624.3435 670.5495 713.7294 765.7570 784.0222 829.5403 847.4684 869.9073 942.6843 949.2412 999.2899 1036.1004 1078.3577 1105.7206 1120.0534 1134.5891 1156.2002 1171.8615 1197.1992 1214.9102 1232.4828 1253.7916 1298.0268 1309.7504 1330.0151 1356.2101 1400.2923 1420.5416 1451.6986 1456.1070 1466.9997 1476.0134 1497.3073 1504.3731 1592.4355 1605.4885 1628.1923 2971.9672 2983.3792 2990.3288 3069.5714 3075.9441 3090.8170 3120.9095 3122.1094 3150.5749 3180.7171 3589.1305
redmass: 5.6224 3.6237 2.7732 3.2365 1.2632 2.8203 3.0930 3.2287 3.4660 1.1787 5.8213 4.9076 4.4095 3.9014 4.4227 3.3936 4.1867 4.5623 4.9552 3.4709 2.0023 2.1520 3.0766 4.9391 1.4369 2.2465 2.8752 1.3571 2.0739 2.2580 2.1900 2.3318 1.3461 2.0418 1.1810 1.1829 1.5917 2.0866 1.6617 1.7901 3.8101 1.5899 2.2351 1.9274 6.3909 1.2294 1.0873 2.1941 1.2097 1.1157 1.1878 2.2250 8.0430 8.1900 7.2512 1.0701 1.0363 1.0657 1.1001 1.0921 1.0949 1.0990 1.0884 1.0927 1.0953 1.0660
irintensity: 2.3351 0.2289 7.6579 4.2069 2.9164 3.0102 3.7666 14.0769 1.7918 116.3157 18.5741 4.2959 13.4182 2.8344 0.8855 0.0916 2.1619 2.2046 1.8781 10.2625 36.9198 57.7963 11.9950 19.2087 1.5779 11.3279 39.8857 3.5355 13.6220 37.7626 26.1779 118.7536 5.8915 89.6448 19.6076 5.7525 24.0404 4.1213 16.6139 120.6091 14.8541 20.0990 70.0925 52.5312 30.2635 21.7315 13.8002 98.2315 21.4753 75.8031 36.4282 5.7119 184.5203 294.1427 8.7796 18.8322 42.0530 21.2825 27.5866 8.7026 14.7021 1.8598 9.4390 18.5709 9.7589 36.6375
temp: 298.150 k
press: 1.00000 atm
elementType: 8 8 7 6 6 6 6 6 6 6 6 6 6 1 1 1 1 1 1 1 1 1 1 1
symmnumber: 1
zpe: 503078.4 jmol-1
zpe.correction: 0.191612 hartree
zpe.thermalcorrener: 0.202819 hartree
zpe.thermalcorrenthalpy: 0.203764 hartree
zpe.thermalcorrgfe: 0.155126 hartree
zpe.sumelectzpe: -591.934983 hartree
zpe.sumelectthermal: -591.923776 hartree
zpe.sumelectthermalent: -591.922832 hartree
zpe.sumelectthermalfe: -591.971470 hartree
dipole: 4.3591 1.4759 -0.1321
dipole: 4.6041
quadrupole: -78.1646 -68.9945 -78.1729
quadrupole: -4.4349 -0.9879 0.4620
quadrupole: -3.0539 6.1161 -3.0622 -4.4349 -0.9879 0.4620
hfenergy: -592.1265957 hartree
pointgroup: C01 [X(C10H11N1O2)]
dipole: 1.7510189 0.4625955 -0.032223 debye
dipolederiv: -1.4831282 -0.2317829 -0.0285112 -0.0192519 -0.5246132 -0.034645 0.0432173 -0.0385389 -0.3599694 -0.4935146 0.5112191 -0.0570228 0.7007696 -0.9970849 0.0441704 -0.0828435 0.0516179 -0.4125396 -1.4652663 -0.1223808 -0.0238164 -0.6294431 -0.7448022 -0.0928975 -0.1146602 -0.1430033 -0.2263657 0.0253551 -0.0386502 -0.017866 -0.0294687 0.0109154 -0.0008742 0.0018822 0.0164282 0.1548499 -0.4127447 0.3025789 -0.0571043 0.3031374 -0.0360401 -0.0228958 -0.0582145 -0.0727305 -0.1040855 0.0026955 0.1290485 0.0190955 0.0965745 -0.1508409 -0.0681407 0.0663314 -0.0811761 0.1007166 1.322551 -0.0006469 -0.0056732 -0.0085992 0.1101381 -0.0506249 -0.0230163 -0.0249654 0.0891115 1.7240774 0.4240502 0.032353 0.784475 0.9957967 0.2071442 0.0277469 0.210016 0.1854604 0.6523554 -0.4809881 0.0430178 -0.6279544 0.8940747 -0.0851968 0.0790006 -0.0684902 0.0753062 -0.4116982 -0.0338125 -0.0020521 -0.2396497 -0.1098328 -0.0050717 -0.0015172 -0.0095629 -0.2296531 0.0366304 -0.1772996 -0.0180483 -0.1972631 0.3421116 0.0019128 0.0566171 0.0194429 0.2304904 -0.1522134 -0.0868491 -0.006235 0.1873783 -0.3586148 0.008379 -0.0238416 0.0240483 -0.225749 0.2592652 -0.0314446 -0.0066326 -0.0774452 0.1388076 -0.0220614 -0.0109536 -0.026635 -0.1290458 0.0404268 0.094083 0.0168467 0.0405623 -0.0325511 -0.0318282 0.0090552 -0.0580887 0.0842533 0.0319382 -0.079234 0.0434363 -0.043934 0.0509354 0.0199327 0.0244191 0.0688626 -0.1185793 -0.0325859 -0.110473 0.0075818 -0.0728549 -0.0225448 0.0155916 0.0202832 0.0450488 0.1028123 0.0800032 0.0489205 0.0405917 0.0294076 0.0727868 0.0304778 -0.0155877 -0.0126566 -0.1047412 0.0576364 0.0859308 -0.0060265 0.0746151 -0.0428312 0.0173373 -0.0106977 0.0216646 0.1678855 0.122684 -0.0372779 0.0552926 0.0302851 -0.0779116 0.0644677 0.0117414 0.1142609 -0.0652678 0.0919122 -0.0650749 -0.1084212 0.0179747 -0.0198675 -0.0644614 -0.0604396 -0.0815756 -0.051636 -0.0204483 0.0657067 0.0384799 -0.0759183 0.172812 0.0253932 0.0109886 0.0138371 0.1283431 -0.1345495 0.0276885 0.0070372 0.0570496 0.0664551 0.0082099 0.0034096 0.0071489 0.1794398 0.0196312 -0.0907431 0.0122375 -0.1014207 -0.059364 0.0231959 0.0178162 0.0208308 0.1536607 0.138987 -0.1025684 0.0214394 -0.1990257 0.3220655 0.0124851 0.0292631 0.0042163 0.3753025 unknown
polarizability: 166.6098962|4.321241|130.5493534|-0.6741419|-1.968352|62.8988433 unknown
InChI: InChI=1S/C10H11NO2/c1-11-8-3-2-4-9(12)7(8)5-6-10(11)13/h2-4,12H,5-6H2,1H3
charge 0 multiplicity 1
24 atoms
O  -3.516616 -0.332677 -0.091565
O  2.646159 -1.907831 0.176942
N  -1.436068 0.721286 0.062248
C  -0.190817 -1.850137 0.283673
C  0.641949 -0.597486 0.102507
C  -1.522861 -1.707094 -0.477951
C  -0.007256 0.665237 -0.003903
C  -2.253348 -0.409944 -0.144752
C  2.052664 -0.633215 0.058888
C  0.756295 1.856224 -0.134983
C  -2.104206 2.019409 0.284188
C  2.827547 0.543327 -0.080888
C  2.163885 1.78371 -0.172693
H  0.36978 -2.732918 -0.064354
H  -0.393579 -2.011173 1.362765
H  -2.216093 -2.534997 -0.258113
H  -1.333591 -1.715805 -1.570521
H  0.265602 2.828767 -0.215587
H  -1.988041 2.686129 -0.59052
H  -1.68987 2.517148 1.177924
H  -3.175432 1.815405 0.430623
H  3.922931 0.492276 -0.112757
H  2.747929 2.704007 -0.278404
H  3.631335 -1.837149 0.128932
