program: Gaussian 09
title: 000182199
version: EM64L-G09RevD.01
frameworkgroup: C1[X(C19H24O5)]
method: RPBEPBE
basis: SDD
operation: Freq
keyword: #pfreq=noraman
keyword: PBEPBE/SDD
title: #p freq=noraman PBEPBE/SDD
converged: YES YES NO NO
title: Mulliken charges:
elementType: O O O O O C C C C C C C C C C C C C C C C C C C H H H H H H H H H H H H H H H H H H H H H H H H
charge: -0.216810 -0.313671 -0.192311 -0.197658 -0.244465 0.120497 -0.126096 -0.157263 -0.176463 -0.114057 -0.033293 -0.468888 -0.285087 0.129448 -0.772991 -0.226575 0.158459 -0.757340 -0.349935 -0.696882 0.220569 0.293195 -0.763047 -0.614956 0.288839 0.252639 0.283864 0.241639 0.217633 0.234456 0.216648 0.290459 0.232779 0.233249 0.246106 0.248899 0.230298 0.217304 0.220713 0.266245 0.251494 0.205188 0.228795 0.240529 0.250447 0.218273 0.224646 0.244478
chargesum: 0.00000
title: Mulliken charges with hydrogens summed into heavy atoms:
elementType: O O O O O C C C C C C C C C C C C C C C C C C C
charge: -0.216810 -0.313671 -0.192311 -0.197658 -0.244465 0.120497 0.162742 0.095375 0.107401 0.127582 0.184340 -0.017783 0.005372 0.129448 -0.060857 0.022324 0.158459 -0.089025 -0.083690 -0.011404 0.220569 0.293195 -0.053798 -0.145832
polarizability: 2.23562125e+02 -1.09321852e+01 2.21768674e+02 -8.13190956e-01 -2.27137222e+01 1.80342984e+02
1716.lowfreq: -16.2256 -13.9099 -5.8774 -0.0006 -0.0003 0.0002 26.1866 29.9970 40.4062
frequency: 26.0722 29.3480 40.3818 66.7110 74.8366 79.7800 83.7892 107.1424 130.4825 145.4595 152.2642 170.2483 188.0648 197.3988 210.7938 215.4707 220.3580 240.5998 254.3496 265.5102 277.7844 294.8753 303.0647 313.6820 327.8072 345.8444 355.0983 389.3523 391.5765 412.9462 464.4861 476.2943 506.3475 535.8569 558.0200 581.2777 614.7212 618.8763 640.4156 644.2221 679.4900 684.0353 710.6382 720.9712 737.9039 764.5513 784.0800 792.8374 819.0735 826.4353 848.6502 878.9168 888.6637 890.6870 926.0475 932.4617 948.3947 956.1228 969.8539 974.4096 980.5773 995.3684 1000.7751 1015.3459 1035.0331 1041.7578 1054.1948 1058.5761 1069.4432 1073.8618 1096.5384 1104.7458 1119.1763 1129.0428 1135.6984 1157.2964 1166.9529 1203.8660 1210.6622 1218.6554 1235.6140 1251.3437 1276.4498 1278.2794 1292.9536 1297.9500 1306.7526 1316.0435 1319.1442 1328.0261 1331.2363 1339.4694 1348.8441 1366.1134 1380.3630 1388.9345 1392.3875 1393.8694 1398.1322 1417.4396 1452.5948 1459.8621 1468.5044 1470.1114 1475.5034 1477.1264 1482.7807 1490.6301 1494.0736 1582.9054 1593.4820 1632.9065 1656.4321 1699.6376 2926.8642 2975.5016 2988.7098 2991.2390 2994.1576 2997.9515 2998.2419 3011.8551 3033.1382 3035.1418 3042.2662 3065.0963 3071.2071 3073.6056 3079.0156 3081.5808 3093.1389 3096.4646 3104.7697 3108.1665 3133.9070 3145.6882 3191.6557 3220.8028
redmass: 3.2121 4.0722 5.4350 4.7984 6.4170 4.1218 4.5042 4.5109 4.5343 1.1618 3.2594 2.8397 2.3525 1.4634 2.9250 1.6633 3.7278 2.6873 2.6650 1.2148 3.2810 3.2125 3.7067 3.8656 3.9247 4.0680 4.2176 3.7339 3.0162 2.9597 3.2563 4.0732 3.8701 4.5707 3.9636 4.3758 4.7355 1.4839 6.0647 4.5656 3.8658 2.5943 4.7614 3.8335 3.7250 3.5603 2.3205 3.1776 2.5663 4.5339 1.9634 4.2558 2.8863 2.4310 4.3900 2.2584 1.9349 1.9500 1.3786 1.7243 1.3225 2.0044 1.4360 2.1742 2.1776 1.9264 1.5020 1.7216 2.2284 1.9795 2.0871 2.7470 2.5994 1.9583 1.8999 2.5969 3.5035 2.8613 1.4270 2.2924 1.4596 1.5441 1.5787 1.3030 1.5060 1.4072 2.6072 1.4581 1.3621 1.4382 1.5037 1.4165 1.4360 1.3789 1.2376 1.2799 1.2097 1.1979 1.2254 1.2266 1.0445 1.0621 1.0616 1.0596 1.0550 1.0515 1.0464 1.0512 1.0670 6.8041 9.9795 11.0534 5.4011 12.4017 1.0799 1.0371 1.0824 1.0364 1.0357 1.0824 1.0389 1.0646 1.0846 1.0847 1.0878 1.0985 1.0982 1.0970 1.0991 1.0996 1.0996 1.1003 1.1008 1.0627 1.0943 1.0896 1.1040 1.1145
irintensity: 0.0806 0.4673 0.4731 3.3050 2.7307 0.7344 4.4240 1.6628 1.4939 0.5713 1.2322 2.2152 1.3662 0.7685 2.2430 1.1165 1.2823 3.6987 1.0519 0.2674 0.8807 1.4964 5.6828 13.0558 0.1028 4.3044 0.4497 1.2878 0.7084 1.1642 4.1667 2.4108 7.5218 3.4095 1.8181 3.8482 1.2743 6.6449 5.6449 9.7115 5.0878 7.7981 3.7938 2.7071 8.1704 8.1664 8.9297 0.4203 11.8066 30.3345 17.6191 38.9535 21.0812 41.6482 49.4400 25.0219 9.8207 23.3883 8.9005 23.8599 42.0664 52.4275 38.0952 44.3331 10.8780 19.8756 5.5196 26.2601 54.3013 11.7571 111.9981 253.4087 12.7154 95.3966 2.0795 3.4362 2.5983 10.7294 6.3328 28.8454 8.4274 7.0670 13.4040 5.3576 2.7311 1.0864 61.3479 3.3265 4.2341 5.6658 4.6029 4.5224 0.6391 0.2321 13.3903 1.9112 5.7466 43.9573 15.0042 19.5333 14.8157 13.7506 25.1266 9.4971 9.0950 5.3540 10.9371 13.9063 16.0383 11.6204 171.2753 208.2932 16.9946 370.3140 3.6666 25.3409 14.2175 15.7781 12.6376 6.5817 23.8157 24.5435 4.1284 4.9804 9.1467 41.5495 40.9907 13.0702 32.4620 17.7737 22.2157 24.4360 16.7048 10.2701 17.5911 9.2444 8.4656 9.9988
temp: 298.150 k
press: 1.00000 atm
elementType: 8 8 8 8 8 6 6 6 6 6 6 6 6 6 6 6 6 6 6 6 6 6 6 6 1 1 1 1 1 1 1 1 1 1 1 1 1 1 1 1 1 1 1 1 1 1 1 1
symmnumber: 1
zpe: 1029443.2 jmol-1
zpe.correction: 0.392094 hartree
zpe.thermalcorrener: 0.416000 hartree
zpe.thermalcorrenthalpy: 0.416944 hartree
zpe.thermalcorrgfe: 0.338938 hartree
zpe.sumelectzpe: -1112.699864 hartree
zpe.sumelectthermal: -1112.675958 hartree
zpe.sumelectthermalent: -1112.675014 hartree
zpe.sumelectthermalfe: -1112.753020 hartree
dipole: -1.7895 5.8212 -1.9792
dipole: 6.4036
quadrupole: -156.2993 -145.3785 -144.1131
quadrupole: 19.5158 17.4362 -5.6498
quadrupole: -7.7023 3.2185 4.4839 19.5158 17.4362 -5.6498
hfenergy: -1113.091958 hartree
pointgroup: C01 [X(C19H24O5)]
dipole: -1.8632684 -0.8146814 1.4872027 debye
polarizability: 222.3374348|-10.5338259|204.9624115|-25.2266911|-18.2578195|198.3739369 unknown
InChI: InChI=1S/C19H24O5/c1-9(2)17(21)24-16-15-11(4)18(22)23-13(15)8-10(3)12-6-7-14(20)19(12,16)5/h6-7,10-13,15-16H,1,8H2,2-5H3
charge 0 multiplicity 1
48 atoms
O  3.240153 -1.089772 0.752555
O  -0.740888 1.290068 0.263379
O  -3.067763 0.244898 -1.441658
O  4.782349 -0.729643 -0.943096
O  0.263552 2.812173 -1.188717
C  -1.176418 -0.98557 -0.337867
C  1.316857 -0.000325 -0.167404
C  -1.132473 -1.513486 1.136089
C  -0.176017 0.166883 -0.576119
C  1.743079 -1.041405 0.922236
C  -0.199946 -2.72217 1.43412
C  1.235082 -2.495083 0.858276
C  2.368758 -0.163539 -1.308522
C  -2.649702 -0.466414 -0.491852
C  -1.086446 -2.093933 -1.427499
C  -2.601517 -1.680932 1.496496
C  3.60806 -0.663528 -0.547945
C  -0.131563 -2.998213 2.957265
C  -3.438665 -1.05662 0.616043
C  2.077484 -1.093343 -2.513032
C  -0.485306 2.587886 -0.202779
C  -1.17562 3.653842 0.588737
C  -0.847287 5.070784 0.166889
C  -2.041983 3.33689 1.590742
H  1.579579 0.975381 0.284534
H  -0.766431 -0.66939 1.763971
H  -0.229896 0.505498 -1.627499
H  1.58985 -0.634326 1.937088
H  -0.616867 -3.623005 0.941036
H  1.950756 -3.100738 1.445681
H  1.311751 -2.863119 -0.178477
H  2.601775 0.834954 -1.719542
H  -0.092161 -2.554344 -1.497571
H  -1.820896 -2.892986 -1.221947
H  -1.333315 -1.655565 -2.411069
H  -2.926446 -2.201943 2.403702
H  0.477594 -3.896471 3.163071
H  0.330221 -2.149744 3.498062
H  -1.131295 -3.169479 3.395345
H  -4.525872 -0.971711 0.681117
H  2.935169 -1.057581 -3.206896
H  1.936436 -2.146458 -2.215006
H  1.180547 -0.759011 -3.062368
H  0.236885 5.267758 0.250971
H  -1.110897 5.231319 -0.893965
H  -1.392392 5.802974 0.78504
H  -2.553489 4.120015 2.161701
H  -2.261884 2.296023 1.845285
