program: Gaussian 09
title: 000196123
version: EM64L-G09RevD.01
frameworkgroup: C1[X(C11H17NO8)]
method: RPBEPBE
basis: SDD
operation: Freq
keyword: #p
keyword: freq=noraman
keyword: PBEPBE/SDD
title: #p freq=noraman PBEPBE/SDD
converged: YES YES NO NO
title: Mulliken charges:
elementType: O O O O O O O O N C C C C C C C C C C C H H H H H H H H H H H H H H H H H
charge: -0.289300 -0.433181 -0.460323 -0.488264 -0.485316 -0.265502 -0.402598 -0.226960 -0.379978 -0.098414 -0.125498 -0.162732 -0.180390 -0.063709 -0.332333 0.230167 -0.375695 0.225162 0.103144 -0.773867 0.278135 0.321094 0.267779 0.264834 0.229806 0.332623 0.280650 0.210051 0.231175 0.364106 0.356743 0.373550 0.252537 0.218369 0.252104 0.360887 0.391142
chargesum: 0.00000
title: Mulliken charges with hydrogens summed into heavy atoms:
elementType: O O O O O O O O N C C C C C C C C C C C
charge: -0.289300 -0.069075 -0.103579 -0.114714 -0.124429 -0.265502 -0.011456 -0.226960 -0.047355 0.179721 0.195596 0.105047 0.084444 0.166097 -0.051683 0.230167 0.065531 0.225162 0.103144 -0.050857
polarizability: 1.81581820e+02 9.74794788e+00 1.67305761e+02 1.76118978e+00 -1.08230235e+01 1.19201830e+02
1716.lowfreq: -2.4107 -0.0008 -0.0005 -0.0004 5.8716 7.2578 25.9216 31.8784 45.7206
frequency: 25.8511 31.8607 45.7068 50.5964 60.8459 67.2533 73.6451 86.2353 95.0977 99.9282 123.6047 154.2977 156.8830 198.1100 225.8730 232.6693 252.4414 258.9780 274.3791 284.6117 295.6656 344.2200 378.1898 402.0594 416.6753 435.9636 467.9587 481.4648 499.5672 502.9366 525.8684 541.6230 569.0565 590.2334 605.1632 618.6475 629.1021 682.1760 692.0341 711.4355 733.4912 798.5088 852.1601 856.3885 877.3141 884.7396 921.1958 939.8077 968.8602 982.6388 993.5210 1009.3653 1035.0337 1041.1022 1044.0134 1058.2474 1072.6962 1073.0965 1122.6348 1127.7027 1150.6023 1170.1607 1185.9611 1193.4354 1220.2226 1239.1412 1257.0305 1264.8535 1286.6885 1294.1915 1306.2077 1319.6746 1325.5370 1331.5260 1343.8628 1359.5983 1373.3969 1377.7841 1387.0778 1391.7081 1413.3752 1450.5549 1463.0351 1464.7458 1478.0517 1614.4189 1633.7650 1637.6561 2964.7352 2974.9295 2998.5954 3017.4724 3036.1479 3055.0956 3057.6634 3077.7023 3098.2315 3103.8696 3181.4151 3494.4719 3508.3927 3508.8159 3518.3924 3557.9991 3600.7541
redmass: 6.7464 6.3178 7.5756 5.7963 4.5936 3.1313 3.0348 1.4461 3.5950 5.7006 5.8199 6.7204 6.3676 5.8176 4.7517 4.9767 1.1537 2.7071 4.3754 5.2392 1.7425 4.8841 4.5014 3.7048 2.6784 6.8028 1.2566 4.6021 1.4533 2.1608 3.8888 3.6835 3.3829 3.5576 3.9625 4.1717 1.3873 4.5727 2.3304 1.4892 5.8358 4.2647 1.6245 2.6569 4.2087 5.7780 4.7633 4.3262 6.2014 1.9547 2.4982 4.3733 2.8987 1.6714 1.9849 2.0490 2.1443 2.5912 2.7774 2.5561 2.1336 1.1592 1.2516 1.3087 1.2726 1.4105 1.3585 1.3522 1.3521 1.5575 1.7624 1.3125 1.3344 1.3074 1.4411 1.2878 1.3918 2.6046 1.2327 1.4020 1.7089 1.0458 1.0858 1.1636 1.7960 6.8554 8.4680 9.0641 1.0770 1.0664 1.0357 1.0847 1.0845 1.1038 1.0864 1.0859 1.0978 1.1013 1.0923 1.0647 1.0773 1.0650 1.0642 1.0667 1.0669
irintensity: 1.5427 0.4839 0.9438 3.3421 8.0256 0.7702 2.6526 0.4720 3.5268 2.7324 3.7323 10.1954 12.8794 2.9875 0.9953 26.6944 139.1815 41.9133 6.3875 8.4090 43.0654 5.1230 16.3064 18.2884 23.0596 5.0432 128.1378 10.7352 106.8122 59.4950 6.5434 20.9747 87.7755 1.4757 2.7256 33.4709 128.8822 32.1724 61.6564 50.8194 29.5596 26.5316 33.5496 6.9188 90.7314 38.6318 5.0723 97.8963 28.7355 13.0794 20.8892 137.6497 121.2650 4.6802 8.2573 72.7389 55.6064 31.3064 118.5488 22.1450 80.3840 13.3452 50.7632 10.7431 6.5543 6.2256 53.2233 33.3667 23.3245 55.9528 53.1738 15.3348 24.7970 15.2369 100.4368 65.8802 10.2612 83.6350 71.9035 4.9110 3.6360 15.4634 3.2180 124.4816 236.2074 180.7884 131.8059 117.1662 11.9727 56.4898 10.0478 5.6613 5.5755 31.9749 16.6989 13.4120 7.9599 19.3597 0.9207 25.1924 59.0762 30.2830 50.4167 10.2219 8.2127
temp: 298.150 k
press: 1.00000 atm
elementType: 8 8 8 8 8 8 8 8 7 6 6 6 6 6 6 6 6 6 6 6 1 1 1 1 1 1 1 1 1 1 1 1 1 1 1 1 1
symmnumber: 1
zpe: 749283.2 jmol-1
zpe.correction: 0.285387 hartree
zpe.thermalcorrener: 0.307355 hartree
zpe.thermalcorrenthalpy: 0.308299 hartree
zpe.thermalcorrgfe: 0.232561 hartree
zpe.sumelectzpe: -1084.318251 hartree
zpe.sumelectthermal: -1084.296283 hartree
zpe.sumelectthermalent: -1084.295339 hartree
zpe.sumelectthermalfe: -1084.371077 hartree
dipole: -0.4799 1.8346 2.4592
dipole: 3.1055
quadrupole: -111.3958 -103.1228 -126.4536
quadrupole: -1.4615 -8.7239 -7.3839
quadrupole: 2.2616 10.5346 -12.7962 -1.4615 -8.7239 -7.3839
hfenergy: -1084.6036383 hartree
pointgroup: C01 [X(C11H17N1O8)]
dipole: -0.7213135 -0.340022 0.9256646 debye
polarizability: 171.6199972|-11.6830859|175.3294406|15.1545842|0.9312453|121.1399737 unknown
InChI: InChI=1S/C11H17NO8/c1-4(14)12-8-5(15)2-7(11(18)19)20-10(8)9(17)6(16)3-13/h2,5-6,8-10,12-13,15-18H,3H2,1H3
charge 0 multiplicity 1
37 atoms
O  -1.055118 0.980167 -0.254292
O  -0.897739 -1.113894 -1.857782
O  2.033174 1.760037 1.808286
O  -1.245714 -2.179696 1.695445
O  -3.125099 -3.850905 0.672991
O  2.752609 -1.82652 -1.443541
O  -2.949743 2.647769 -0.925467
O  -1.664989 4.528376 -0.454098
N  2.358285 -0.545774 0.45986
C  -0.050525 -0.040687 0.212515
C  1.396557 0.369591 -0.159299
C  -0.530904 -1.347055 -0.458878
C  1.709991 1.805701 0.342229
C  -1.710431 -1.97113 0.314086
C  0.584083 2.761607 0.072601
C  -0.677083 2.314059 -0.212419
C  -2.140599 -3.310681 -0.291512
C  3.006265 -1.561387 -0.228942
C  -1.775115 3.282062 -0.52502
C  4.042372 -2.335652 0.579633
H  -0.156227 -0.128055 1.311324
H  1.520933 0.309479 -1.257001
H  0.308572 -2.061072 -0.488192
H  2.650109 2.152172 -0.118703
H  -2.577475 -1.27561 0.311534
H  2.611888 -0.313483 1.425364
H  0.762241 3.839417 0.097059
H  -1.26516 -3.987523 -0.375376
H  -2.587266 -3.153627 -1.290458
H  -1.453575 -0.288187 -1.872978
H  1.220985 2.012676 2.317519
H  -1.889774 -2.817268 2.105581
H  5.020213 -2.261091 0.073242
H  4.147216 -1.97899 1.618335
H  3.764423 -3.403657 0.594564
H  -3.4096 -4.75633 0.398463
H  -3.63598 3.340954 -1.126476
