program: Gaussian 09
title: 000196063
version: EM64L-G09RevD.01
frameworkgroup: C1[X(C7H10N6)]
method: RPBEPBE
basis: SDD
operation: Freq
keyword: #pfreq=noraman
keyword: PBEPBE/SDD
title: #p freq=noraman PBEPBE/SDD
converged: YES YES NO NO
title: Mulliken charges:
elementType: N N N N N N C C C C C C C H H H H H H H H H H
charge: -0.189633 -0.270452 -0.083027 -0.033272 -0.063740 -0.611247 0.138359 -0.081260 -0.335520 -0.217259 0.171375 -0.682923 -0.363825 0.290967 0.238631 0.227356 0.277502 0.232867 0.212358 0.223705 0.242624 0.332406 0.344007
chargesum: 0.00000
title: Mulliken charges with hydrogens summed into heavy atoms:
elementType: N N N N N N C C C C C C C
charge: -0.189633 0.020515 -0.083027 -0.033272 -0.063740 0.065166 0.138359 -0.081260 0.130467 0.060243 0.171375 -0.013993 -0.121200
polarizability: 1.63518280e+02 -1.98050918e+00 1.24116163e+02 -8.08505723e+00 -2.88914841e+00 6.34730059e+01
1716.lowfreq: -4.2356 0.0006 0.0007 0.0008 4.8841 7.3655 56.5228 64.5721 74.9968
frequency: 56.5058 64.5608 74.9785 153.9059 200.2493 217.9019 243.8530 277.3746 287.6979 315.3997 400.6543 509.0202 512.1494 544.8369 546.8387 556.9580 578.6176 638.2807 665.3000 678.6346 710.8239 793.5095 797.5393 824.3998 830.3490 849.8396 906.3901 928.7896 958.6696 1020.8123 1057.7848 1119.1342 1147.8725 1154.7781 1185.7361 1217.4883 1256.4992 1288.6313 1304.8654 1316.8545 1356.0090 1362.7527 1377.5544 1395.0823 1419.4771 1448.9443 1469.5372 1480.3083 1493.9524 1497.8816 1544.5227 1576.8338 1631.4897 2970.3625 2986.7951 3047.8988 3083.4680 3099.6262 3164.9147 3246.4496 3396.6484 3540.5491 3695.9387
redmass: 3.6526 3.3249 1.9363 5.5022 4.7299 3.0727 1.2747 4.8213 3.1284 3.5316 5.1496 8.9250 1.2273 3.8774 1.0827 3.5256 4.9530 4.1398 10.3571 3.1945 6.9963 2.0021 5.4606 1.2590 1.6138 8.2513 1.5884 1.4297 2.4769 4.0449 3.3034 1.7174 5.0623 2.1523 1.8803 2.5734 1.2728 4.9366 3.9444 5.4208 1.4581 2.3070 2.9601 1.2609 3.0142 2.2865 1.1707 1.0539 1.3146 1.1149 7.8965 1.8964 2.6705 1.0649 1.0371 1.0975 1.0991 1.1005 1.0920 1.0993 1.0748 1.0442 1.1056
irintensity: 1.8036 3.0828 1.5178 3.1049 6.6493 6.1057 2.9979 5.5365 2.6125 1.6851 2.5650 2.6318 277.3486 8.6518 0.8531 3.8129 0.9259 25.6243 12.9954 50.1126 20.6708 39.3228 12.0475 8.3168 9.0520 2.7991 12.0918 12.2896 11.3806 18.6279 14.7207 11.0420 8.1910 10.2650 22.4754 17.7216 0.5582 84.9193 15.4566 39.6195 9.6554 24.5629 7.0172 16.4107 42.5442 23.6775 6.7579 8.9742 5.3169 8.1139 49.7180 28.8356 588.4148 30.8797 27.0244 6.7331 48.4884 27.5497 17.1834 0.5537 1.1903 119.3701 49.5752
temp: 298.150 k
press: 1.00000 atm
elementType: 7 7 7 7 7 7 6 6 6 6 6 6 6 1 1 1 1 1 1 1 1 1 1
symmnumber: 1
zpe: 475404.8 jmol-1
zpe.correction: 0.181072 hartree
zpe.thermalcorrener: 0.192602 hartree
zpe.thermalcorrenthalpy: 0.193546 hartree
zpe.thermalcorrgfe: 0.143119 hartree
zpe.sumelectzpe: -600.278153 hartree
zpe.sumelectthermal: -600.266623 hartree
zpe.sumelectthermalent: -600.265679 hartree
zpe.sumelectthermalfe: -600.316106 hartree
dipole: 1.2027 -0.8118 0.4036
dipole: 1.5061
quadrupole: -60.4092 -80.3538 -76.4758
quadrupole: 5.1137 -0.9103 -0.6697
quadrupole: 12.0037 -7.9409 -4.0629 5.1137 -0.9103 -0.6697
hfenergy: -600.4592252 hartree
pointgroup: C01 [X(C7H10N6)]
dipole: -0.4876847 0.3126893 0.1245883 debye
dipolederiv: -0.3167913 0.0435508 0.0368917 0.0111514 -0.2406595 -0.0115639 0.0320988 0.0351284 -0.1468431 -0.0755383 0.0741738 -0.0344278 0.0346104 -0.2891736 0.2226373 0.0778595 0.1615815 -0.1907732 -0.6427768 -0.0549128 -0.0113899 -0.0270069 -0.4036682 0.0062164 -0.0822507 -0.0061465 -0.247449 -0.8023021 0.0940305 -0.0763895 0.1685425 -0.6262492 0.0175813 -0.069499 0.0166537 -0.1972034 -0.7501323 -0.060023 -0.0595625 -0.5770062 -0.7400005 -0.0669831 -0.0676289 0.0083158 -0.2488989 -1.2828903 -0.4857001 -0.0584386 -0.7059261 -0.4725543 -0.105782 -0.0693514 -0.0796257 -0.6921486 0.5373505 -0.2347974 0.0422011 -0.2123271 0.3527505 0.005465 0.0611081 -0.0364232 0.1101122 -0.6574431 -0.2540367 -0.0673416 -0.0913668 0.0680112 -0.0043705 -0.0881166 -0.0430906 -0.0101951 0.279712 0.0298822 -0.1497785 -0.062235 0.2571058 -0.0766789 -0.3095668 -0.1071224 0.3362468 0.3877151 0.1946447 0.052052 0.527062 0.3794607 0.0054677 0.0580548 0.0119827 -0.0417641 1.6090566 0.537439 0.1755044 0.7585909 0.7386979 0.0937913 0.1914943 0.0594684 0.2390433 -0.1005293 -0.0518327 0.0130655 -0.0780029 0.0717477 0.0318541 0.0834718 0.0201712 0.0448461 0.9057836 -0.0192549 0.1337068 0.1333805 0.5399072 0.0094177 0.1492941 -0.0241507 -0.0557735 0.1204909 -0.0219473 0.0814799 -0.1023591 0.1075004 -0.1585296 0.0936516 -0.0518821 0.1550455 -0.0165594 0.0815738 -0.0509406 0.0387508 -0.0589848 0.1121871 0.0121998 0.0691135 -0.0173417 0.0591009 -0.0424023 -0.0065188 -0.0165741 -0.0546412 -0.118652 0.0166319 -0.0634665 -0.053535 0.0643265 0.0564048 -0.022092 0.0355115 0.080028 0.0091028 -0.0199343 0.0106573 0.1664021 0.0162912 0.0628947 -0.0462116 0.1326182 -0.0444413 0.0650953 -0.0975619 0.055057 0.0688384 0.0718837 0.0225086 0.0213761 -0.0118376 -0.0383578 -0.1316162 -0.0428845 -0.1401474 -0.0308409 -0.0031281 -0.0447974 0.0751779 -0.068209 0.078255 0.0642949 0.1164806 0.0727539 -0.0678202 0.0821183 0.0126785 -0.0058801 0.016657 -0.0933022 0.0064414 -0.0070186 0.0098524 0.1251562 0.2832032 0.0176202 -0.0163126 -0.0099074 0.1683872 0.0055522 -0.0134935 0.0095296 0.3787008 0.2310586 0.0423031 -0.0261713 0.1058829 0.2201811 0.0190716 -0.0250392 0.0117895 0.3761955 unknown
polarizability: 163.5145575|0.6045082|124.0479069|8.5481839|-2.9508629|63.544984 unknown
InChI: InChI=1S/C7H10N6/c1-2-12-13-4-11-5-6(8)9-3-10-7(5)13/h3-4,12H,2,8H2,1H3
charge 0 multiplicity 1
23 atoms
N  -1.098874 0.658687 -0.373794
N  -2.462415 0.298833 -0.547849
N  0.707297 2.04724 -0.128068
N  0.036554 -1.548095 -0.116864
N  2.457899 -1.284639 0.246326
N  3.5259 0.822369 0.342455
C  0.004768 -0.184655 -0.15845
C  1.108186 0.698321 -0.018258
C  -3.083377 -0.259842 0.698434
C  -0.618825 1.977433 -0.342373
C  2.380172 0.088502 0.192853
C  -4.524595 -0.688035 0.384059
C  1.307725 -2.010551 0.090579
H  -2.521115 -0.379721 -1.325054
H  -2.498217 -1.117199 1.091831
H  -3.076285 0.541385 1.458423
H  -1.291316 2.819336 -0.48692
H  -5.107233 0.160081 -0.015575
H  -4.548512 -1.508347 -0.358094
H  -5.020568 -1.053848 1.299896
H  1.423742 -3.097426 0.139482
H  4.408355 0.33656 0.487589
H  3.484734 1.838511 0.303673
