program: Gaussian 09
title: 000017318
version: EM64L-G09RevD.01
frameworkgroup: C1[X(C10H20O5Si)]
method: RPBEPBE
basis: SDD
operation: Freq
keyword: #p
keyword: freq=noraman
keyword: PBEPBE/SDD
title: #p freq=noraman PBEPBE/SDD
converged: YES YES NO NO
title: Mulliken charges:
elementType: Si O O O O O C C C C C C C C C C H H H H H H H H H H H H H H H H H H H H
charge: 1.554851 -0.592577 -0.577288 -0.577228 -0.273947 -0.250615 -0.931500 -0.338428 -0.254459 -0.476381 -0.489971 -0.490177 0.159699 0.341967 -0.753600 -0.633165 0.256250 0.256012 0.227886 0.227541 0.223432 0.223355 0.229400 0.218584 0.218335 0.205574 0.216236 0.239349 0.239353 0.216409 0.205613 0.240784 0.240673 0.214356 0.228753 0.254925
chargesum: 0.00000
title: Mulliken charges with hydrogens summed into heavy atoms:
elementType: Si O O O O O C C C C C C C C C C
charge: 1.554851 -0.592577 -0.577288 -0.577228 -0.273947 -0.250615 -0.419238 0.116999 0.192328 0.189938 0.171188 0.171198 0.159699 0.341967 -0.057787 -0.149486
polarizability: 1.96731236e+02 1.09321305e-01 1.20035455e+02 -1.97159099e-01 3.18874044e-01 1.28239386e+02
1716.lowfreq: -54.8769 -4.0622 -0.8312 -0.0010 -0.0003 0.0006 4.7397 13.3587 18.6246
frequency: -54.6582 10.8778 15.7850 26.9747 38.7650 50.3732 59.1660 70.7593 74.7783 77.8245 80.2393 83.8674 90.6806 122.4571 135.7084 143.5711 156.6569 176.0511 182.5698 221.4160 229.1414 293.0920 321.4945 342.0255 350.9473 382.2650 393.2137 416.8672 501.6563 566.5949 580.2842 632.7627 686.5148 713.4194 756.5074 777.9681 784.3674 811.5442 826.0079 920.6640 955.3416 988.2696 1006.4394 1011.9379 1028.9516 1050.5679 1052.2474 1052.4262 1069.0848 1081.7080 1115.8402 1120.2589 1123.8229 1123.8426 1144.0044 1146.7211 1151.0764 1157.5197 1230.6138 1250.2896 1285.9693 1287.7512 1322.6326 1372.7597 1394.9334 1413.9542 1433.8235 1445.5239 1448.1551 1451.2278 1454.9646 1468.0887 1468.3000 1469.5448 1471.2866 1472.0524 1474.4861 1475.3556 1476.5718 1487.5118 1606.8796 1653.6777 2942.6742 2944.4053 2960.2675 2988.8039 2990.4312 2995.7255 3007.3881 3025.3414 3026.0989 3036.5220 3047.2498 3052.0020 3074.2351 3078.0521 3090.7468 3090.9306 3094.4259 3098.0834 3103.4002 3215.7037
redmass: 1.1307 3.9384 3.7377 2.6784 4.0935 3.6631 2.8884 4.1874 1.4833 1.1255 1.5504 3.7264 1.8100 3.5266 5.2015 3.2595 1.0821 2.9707 4.3781 4.5915 3.9365 5.3548 5.0487 5.9215 3.3461 3.3206 3.6002 6.4239 5.2959 5.1817 4.3356 1.5304 2.8941 8.9299 1.3086 6.6388 2.0727 7.6108 1.4627 3.5107 2.6391 1.3181 1.4038 1.3139 4.5459 6.6500 1.5089 5.2816 4.9828 2.7804 4.7211 1.2512 1.2568 1.2546 1.3825 1.4259 1.4854 1.2466 1.3184 1.2278 2.9737 1.0832 1.4408 1.5425 1.1655 1.2503 1.0837 1.1220 1.1220 1.1146 1.0453 1.0599 1.0534 1.0572 1.0512 1.0644 1.0597 1.0514 1.0517 1.0896 11.4223 5.2062 1.0334 1.0336 1.0311 1.0591 1.0361 1.0582 1.0587 1.1024 1.1024 1.0999 1.1037 1.1042 1.0970 1.1062 1.0994 1.0993 1.1017 1.1009 1.0618 1.1157
irintensity: 0.1644 1.4864 0.0904 0.0630 0.3856 1.7326 10.6425 0.5002 1.3251 0.8009 2.4763 0.9560 0.2318 2.8291 16.7544 7.3839 0.0009 11.6797 10.5141 13.1661 3.0016 9.2693 30.8683 15.8179 13.4015 15.5298 0.2494 24.7274 2.0553 22.1381 13.3846 9.9076 12.9788 111.9305 37.6776 115.8148 5.5110 1.0310 32.5956 16.0218 18.2299 57.7772 28.1367 0.2170 95.2267 233.7138 11.8277 451.8683 38.0445 49.7742 438.9846 0.1144 0.3131 0.2810 21.3582 73.9489 0.5006 9.2306 33.7785 2.5699 117.7217 0.4989 0.6795 1.1923 22.2337 11.7150 12.9544 1.0511 0.1925 4.1517 15.4438 18.1517 14.6023 15.2390 0.8609 28.5931 1.2723 0.2083 11.8173 10.5044 146.4593 4.5253 141.5290 14.1847 80.0791 5.9764 15.5249 6.6027 33.4007 9.4762 123.8175 2.9842 51.5648 0.2133 12.1852 57.6546 12.9599 54.7590 31.6988 28.4063 5.5136 5.8042
temp: 298.150 k
press: 1.00000 atm
elementType: 14 8 8 8 8 8 6 6 6 6 6 6 6 6 6 6 1 1 1 1 1 1 1 1 1 1 1 1 1 1 1 1 1 1 1 1
symmnumber: 1
zpe: 763604.8 jmol-1
zpe.correction: 0.290842 hartree
zpe.thermalcorrener: 0.312985 hartree
zpe.thermalcorrenthalpy: 0.313929 hartree
zpe.thermalcorrgfe: 0.233694 hartree
zpe.sumelectzpe: -1057.310136 hartree
zpe.sumelectthermal: -1057.287993 hartree
zpe.sumelectthermalent: -1057.287049 hartree
zpe.sumelectthermalfe: -1057.367283 hartree
dipole: 1.2220 0.0218 0.2823
dipole: 1.2544
quadrupole: -94.3908 -92.4569 -115.5301
quadrupole: -0.2934 -15.7443 -0.3475
quadrupole: 6.4018 8.3357 -14.7375 -0.2934 -15.7443 -0.3475
hfenergy: -1057.6009776 hartree
pointgroup: C01 [X(C10H20O5Si1)]
dipole: 0.4817113 -0.0054167 -0.1072004 debye
polarizability: 196.7231103|0.1736913|120.0291927|0.7603076|0.2219464|128.2537736 unknown
InChI: InChI=1S/C10H20O5Si/c1-9(2)10(11)15-7-6-8-16(12-3,13-4)14-5/h1,6-8H2,2-5H3
charge 0 multiplicity 1
36 atoms
Si 2.907919 0.010249 -0.028933
O  4.166113 0.017287 1.149001
O  3.028856 1.335917 -1.115482
O  3.042285 -1.318112 -1.110631
O  -2.398578 -0.012378 -0.017021
O  -3.825766 0.002436 1.825485
C  1.295135 0.005211 0.963443
C  0.028702 -0.003385 0.067963
C  -1.240684 -0.001285 0.92162
C  5.601993 0.022689 0.870417
C  2.991646 2.745208 -0.744257
C  3.014548 -2.726305 -0.734357
C  -3.667219 -0.00934 0.578754
C  -4.751683 -0.021764 -0.459776
C  -4.363056 -0.037165 -1.92358
C  -6.038395 -0.018438 -0.0139
H  1.303219 -0.87755 1.633048
H  1.295127 0.892211 1.627561
H  0.021525 0.878092 -0.600485
H  0.025894 -0.893175 -0.58943
H  -1.31339 0.897887 1.562059
H  -1.307301 -0.891211 1.575503
H  6.116033 0.004107 1.845139
H  5.901783 -0.865002 0.280302
H  5.900768 0.933242 0.315749
H  2.047892 3.012961 -0.225468
H  3.844963 3.020316 -0.092869
H  3.0554 3.320281 -1.682136
H  3.089351 -3.304274 -1.669634
H  3.86568 -2.991922 -0.076191
H  2.069539 -2.999967 -0.220965
H  -3.749837 0.845236 -2.179995
H  -3.746889 -0.922935 -2.16058
H  -5.259647 -0.04571 -2.566235
H  -6.8835 -0.027086 -0.710599
H  -6.254026 -0.007227 1.060078
