program: Gaussian 09
title: 000196384
version: EM64L-G09RevD.01
frameworkgroup: C1[X(C16H26NO12P)]
method: RPBEPBE
basis: SDD
operation: Freq
keyword: #p
keyword: freq=noraman
keyword: PBEPBE/SDD
title: #p freq=noraman PBEPBE/SDD
converged: YES YES NO NO
title: Mulliken charges:
elementType: P O O O O O O O O O O O O N C C C C C C C C C C C C C C C C H H H H H H H H H H H H H H H H H H H H H H H H H H
charge: 1.402480 -0.236721 -0.497692 -0.357158 -0.489485 -0.264398 -0.442545 -0.454907 -0.667348 -0.688275 -0.627089 -0.525844 -0.431499 -0.696865 -0.143263 -0.114529 -0.173678 -0.046632 -0.278372 -0.380753 -0.093889 -0.146460 -0.180255 0.365859 -0.346477 -0.310991 -0.371040 -0.415251 -0.385589 0.505908 0.293670 0.288343 0.269136 0.255676 0.198884 0.235512 0.399422 0.219014 0.219575 0.264326 0.281009 0.238407 0.212923 0.226167 0.352869 0.280838 0.252763 0.344208 0.417820 0.422241 0.404796 0.223466 0.224531 0.348559 0.309053 0.309548
chargesum: 0.00000
title: Mulliken charges with hydrogens summed into heavy atoms:
elementType: P O O O O O O O O O O O O N C C C C C C C C C C C C C C C C
charge: 1.402480 -0.236721 -0.497692 -0.357158 -0.090063 -0.264398 -0.089676 -0.110699 -0.249528 -0.266034 -0.627089 -0.121048 -0.082940 -0.078264 0.150407 0.173815 0.095458 0.209044 0.156025 0.057836 0.170438 0.134549 0.058152 0.365859 0.092613 -0.030153 -0.118277 -0.191785 -0.161058 0.505908
polarizability: 2.63875594e+02 -2.93599646e+01 2.71430844e+02 1.08610531e+00 -4.65886573e+00 2.05610442e+02
1716.lowfreq: -11.7440 -6.9283 -2.9577 -0.0016 -0.0012 -0.0009 8.8932 19.6065 26.9135
frequency: -1.4257 19.3342 26.8006 36.0285 43.6941 46.4779 54.2840 59.1614 81.1274 89.5295 92.5600 106.4235 119.6026 125.5308 135.3461 147.1808 149.7647 162.8863 178.2482 189.1772 201.6118 212.1366 238.9815 242.3547 247.4287 262.1181 268.9851 274.2444 286.9661 310.4062 328.8139 339.3393 343.0580 347.3254 360.0090 363.1001 369.3099 377.5391 391.8018 403.1833 407.1435 415.1438 430.2554 438.9970 484.7539 495.5410 502.3555 509.5696 515.4170 529.1161 543.3836 548.1068 589.6851 594.3209 600.5635 635.6091 647.0022 664.5069 682.8370 706.0373 725.9469 740.4301 751.6087 767.5558 782.3220 803.3569 808.6044 824.4768 829.0839 830.7988 858.3009 866.7016 892.9574 928.5188 932.5852 936.5044 940.0129 946.6717 964.9490 967.8024 981.0421 987.4298 993.1080 996.1825 1003.3711 1019.5450 1026.8872 1038.1453 1046.2984 1054.8670 1061.8098 1069.6475 1076.8287 1093.1724 1098.8597 1107.0398 1127.4099 1128.8782 1166.8045 1169.9398 1185.7736 1190.9663 1204.9508 1220.5437 1228.1912 1237.2746 1242.4015 1244.1863 1254.6764 1273.5550 1294.2843 1295.4256 1307.4880 1315.9457 1318.4408 1320.9025 1327.8597 1334.5753 1336.9088 1340.2013 1361.8820 1372.4872 1382.2990 1386.6322 1387.4840 1404.8100 1413.8497 1418.8996 1438.0661 1464.2014 1469.0991 1469.6781 1507.3797 1590.3199 1631.5868 1647.5832 2923.5516 2966.1579 2975.2283 2993.7654 2998.3329 3020.3734 3036.3412 3049.8902 3050.9936 3058.2316 3075.7691 3082.9029 3092.3904 3127.9501 3133.4405 3153.4890 3166.8244 3289.9065 3460.5356 3473.3470 3505.9662 3506.8883 3529.8351 3568.8828 3585.0885 3708.0526
redmass: 6.1451 6.4015 6.5585 4.6689 4.6831 7.8872 6.9600 6.8647 5.6148 6.8055 5.6796 6.2619 5.7406 4.7268 5.5046 3.8025 5.0559 4.5968 4.7726 4.4038 3.6320 4.3126 5.4998 4.8423 5.4782 4.9165 4.4240 3.9187 2.6533 4.4208 3.5733 3.4787 4.5865 4.8280 1.9959 1.0805 2.1045 4.2825 4.0197 1.2512 4.0993 2.8428 4.3856 2.8404 1.2518 3.5423 2.8313 2.9484 1.2367 1.5006 3.0763 3.6278 1.7371 2.5783 3.5651 6.7505 6.5057 3.3974 5.5932 3.4280 4.5165 6.6118 1.4160 10.0704 4.5185 3.0682 1.2951 1.8616 3.1627 4.6271 3.6741 4.1107 4.7111 2.8707 1.5207 3.9774 2.7137 1.3463 4.9077 4.1662 2.0682 2.1001 3.0142 2.8376 3.8756 1.4381 2.5876 2.2940 3.2968 2.1493 3.0273 2.3837 1.8009 2.6638 2.8971 2.1099 1.2471 2.5269 1.9516 1.1996 1.2554 1.4735 1.1746 1.3914 1.2964 1.1832 1.2979 1.3484 1.2572 1.2074 1.2945 1.3300 1.3712 1.1972 2.4639 1.2137 1.3156 1.2590 1.3080 1.2590 1.2427 1.2927 1.2359 5.3775 1.2276 1.3328 1.6209 1.4691 3.4855 1.0812 1.0814 1.0811 2.9549 7.3249 2.7257 1.5266 1.0604 1.0677 1.0632 1.0846 1.0990 1.0849 1.0864 1.0876 1.0855 1.0987 1.0964 1.0876 1.0878 1.0885 1.0890 1.0963 1.0960 1.0690 1.0661 1.0643 1.0653 1.0650 1.0657 1.0451 1.0660 1.1040
irintensity: 1.6531 0.2783 1.2248 0.5968 0.6222 1.2962 0.1770 1.2572 2.7728 4.9916 13.7704 6.5317 7.9868 37.6828 7.8872 28.0193 6.4362 6.5112 32.3724 2.6061 33.2249 4.2252 43.5865 2.9519 19.2466 3.1141 6.5286 9.4597 62.2293 6.0885 5.2911 29.0699 6.4864 29.4187 108.7004 0.9399 266.5196 2.7264 21.3409 25.0975 10.8451 0.4578 4.3432 18.3166 172.1971 18.9401 31.7725 31.8586 224.8113 81.2369 17.1925 18.2151 55.1384 108.0206 18.8392 5.7675 32.6469 6.8555 36.2963 7.6126 7.9046 248.5363 23.7247 150.9045 186.2857 5.8114 1.2309 83.8783 70.3814 23.4380 23.2747 74.9549 9.1502 60.1729 36.8747 325.3293 73.5602 0.5289 125.0156 121.9077 91.4354 93.0764 35.7662 6.5069 164.0955 4.6910 81.6322 111.1629 81.8006 60.5835 59.6305 5.4908 30.3607 12.8656 12.1191 120.6316 25.4919 18.7045 73.8968 45.8804 26.7715 105.0324 26.1263 6.2966 21.2386 4.7912 8.0305 46.6414 4.9608 7.8388 15.7726 26.1564 4.1135 12.7419 12.4815 9.2398 23.9076 10.3516 2.6633 8.3859 21.8066 30.1546 36.0909 9.7936 4.3154 3.7043 8.1976 5.6603 0.9797 8.9145 7.4569 11.8070 293.5344 1.3276 0.3994 229.7645 64.3073 45.8349 62.8514 24.9360 10.5059 4.7135 34.0934 18.5262 7.5381 12.8343 19.2637 10.3648 19.8618 15.4283 22.9748 3.0163 3.4554 555.5978 78.6530 9.7065 14.7536 84.1636 4.5218 86.4896 112.8642 22.5730
temp: 298.150 k
press: 1.00000 atm
elementType: 15 8 8 8 8 8 8 8 8 8 8 8 8 7 6 6 6 6 6 6 6 6 6 6 6 6 6 6 6 6 1 1 1 1 1 1 1 1 1 1 1 1 1 1 1 1 1 1 1 1 1 1 1 1 1 1
symmnumber: 1
zpe: 1134500.1 jmol-1
zpe.correction: 0.432108 hartree
zpe.thermalcorrener: 0.463616 hartree
zpe.thermalcorrenthalpy: 0.464561 hartree
zpe.thermalcorrgfe: 0.369335 hartree
zpe.sumelectzpe: -1921.542226 hartree
zpe.sumelectthermal: -1921.510718 hartree
zpe.sumelectthermalent: -1921.509774 hartree
zpe.sumelectthermalfe: -1921.604999 hartree
dipole: 1.7232 6.1609 -2.5744
dipole: 6.8959
quadrupole: -220.1363 -163.8379 -178.3644
quadrupole: -17.4982 6.3317 0.1227
quadrupole: -32.6901 23.6083 9.0818 -17.4982 6.3317 0.1227
hfenergy: -1921.9743345 hartree
pointgroup: C01 [X(C16H26N1O12P1)]
dipole: 0.3776245 2.2411977 -1.4816026 debye
polarizability: 271.0911696|-28.503151|260.2244605|7.3976268|-15.4318722|209.6012502 unknown
InChI: InChI=1S/C16H26NO12P/c17-8-1-3-9(4-2-8)27-16-14(22)15(29-30(23,24)25)12(28-16)7-26-6-11(20)13(21)10(19)5-18/h1-4,10-16,18-24H,5-7,17H2
charge 0 multiplicity 1
56 atoms
P  5.172039 0.393203 -0.014021
O  0.731146 -0.320152 -0.834151
O  3.757222 -0.434531 -0.59124
O  -0.20801 1.301646 0.675854
O  2.965518 1.580913 1.247957
O  -0.155351 -3.125981 -0.423276
O  -2.683132 -4.94596 1.713029
O  -3.672264 -3.36903 -0.558951
O  6.369558 -0.182423 -1.064881
O  5.06278 1.98906 -0.641205
O  5.427045 0.189492 1.543788
O  -1.838953 -0.839047 1.521225
O  -4.52479 -0.225471 1.464321
N  -3.668948 4.975362 -1.901301
C  2.732785 -0.802619 0.410918
C  1.586763 -1.462396 -0.37551
C  2.055954 0.46126 1.022136
C  1.000232 0.866654 -0.020899
C  0.800702 -2.471515 0.468478
C  -0.916958 -4.196827 0.242542
C  -2.008382 -3.721789 1.235362
C  -3.068699 -2.763851 0.654331
C  -2.616276 -1.318035 0.354493
C  -1.04508 2.2365 -0.032168
C  -3.839035 -0.388809 0.17908
C  -1.238548 2.169521 -1.429034
C  -1.720465 3.196733 0.74639
C  -2.105153 3.090473 -2.051181
C  -2.599085 4.104226 0.125791
C  -2.803709 4.070383 -1.286138
H  3.187297 -1.452207 1.179595
H  1.958522 -1.950029 -1.291169
H  1.541892 0.17957 1.961429
H  1.340683 1.684528 -0.68144
H  1.508764 -3.2274 0.879224
H  0.2696 -1.972661 1.304791
H  3.583326 1.361162 1.999984
H  -1.385139 -4.763194 -0.582632
H  -0.231866 -4.882142 0.782859
H  -1.569102 -3.26376 2.134798
H  -3.90669 -2.732535 1.373861
H  -1.978502 -1.305031 -0.553241
H  -3.509051 0.593862 -0.218848
H  -4.571323 -0.837787 -0.512968
H  -3.333943 -5.204897 1.00624
H  -0.73961 1.3959 -2.022716
H  -1.554518 3.227115 1.827637
H  -3.028242 -3.275642 -1.309154
H  6.658188 0.476171 -1.748023
H  4.29423 2.480457 -0.238815
H  -1.277057 -0.053907 1.242612
H  -2.255394 3.039541 -3.13606
H  -3.128767 4.845898 0.734871
H  -3.795876 -0.12151 2.136312
H  -3.836372 4.939435 -2.902216
H  -4.192459 5.650472 -1.35227
