program: Gaussian 09
title: 000196083
version: EM64L-G09RevD.01
frameworkgroup: C1[X(C17H20N2)]
method: RPBEPBE
basis: SDD
operation: Freq
keyword: #pfreq=noraman
keyword: PBEPBE/SDD
title: #p freq=noraman PBEPBE/SDD
converged: YES YES NO NO
title: Mulliken charges:
elementType: N N C C C C C C C C C C C C C C C C C H H H H H H H H H H H H H H H H H H H H
charge: -0.234080 -0.078459 0.192375 0.189522 -0.495817 -0.654955 0.349001 0.346341 -0.382831 -0.335673 -0.353615 -0.403286 -0.402994 -0.264900 -0.267066 -0.266452 -0.267011 -0.615623 -0.622178 0.252880 0.242004 0.229501 0.241294 0.207264 0.252290 0.235446 0.259835 0.228108 0.227747 0.222327 0.223892 0.226372 0.226154 0.222907 0.229407 0.190993 0.236335 0.224694 0.188252
chargesum: 0.00000
title: Mulliken charges with hydrogens summed into heavy atoms:
elementType: N N C C C C C C C C C C C C C C C C C
charge: -0.234080 -0.078459 0.192375 0.189522 -0.000934 -0.184159 0.349001 0.346341 0.076723 -0.100227 -0.093780 -0.175178 -0.175247 -0.042573 -0.043174 -0.040080 -0.040857 0.027684 0.027103
polarizability: 2.27173612e+02 -5.83624808e+00 2.65348443e+02 9.09470481e+00 -4.21202009e-01 1.07930094e+02
1716.lowfreq: -6.1142 -0.0007 0.0002 0.0004 4.4736 9.2778 21.8932 45.5166 53.0116
frequency: 21.7439 45.5006 52.9615 57.7779 111.3273 153.8339 168.2522 188.0828 213.5536 241.0310 244.3519 251.0138 290.6941 326.6862 342.9594 370.0561 379.1999 416.7559 430.1156 433.1648 446.9129 454.1843 531.7270 550.2221 557.1743 587.8469 609.9842 637.5264 691.8389 714.9182 724.4932 750.4558 754.1976 784.2172 814.4486 821.6782 837.4332 847.9460 855.5545 883.8875 915.4529 930.1539 963.2248 968.5419 971.4210 1008.5397 1033.8097 1043.8814 1045.7016 1046.5357 1068.3028 1083.4821 1091.0693 1095.0100 1141.2499 1147.5252 1174.8502 1178.5352 1182.0159 1182.4027 1205.5335 1214.9829 1239.2661 1250.7166 1261.6178 1268.3434 1297.1324 1305.2456 1328.2853 1329.2625 1359.3808 1381.2875 1389.2255 1391.2377 1419.5375 1442.1954 1443.6172 1451.7092 1456.2601 1462.5497 1467.3816 1478.3391 1481.4912 1483.2530 1486.6063 1502.2476 1513.1665 1580.9452 1602.3892 1604.5000 1622.8878 2847.7663 2853.4642 2870.6495 2918.7265 3015.4788 3021.0972 3021.1733 3029.8622 3037.2401 3073.3281 3079.6336 3085.6005 3115.7882 3116.1669 3130.5272 3130.8171 3154.5664 3155.8624 3167.5070 3169.2356
redmass: 3.4659 3.6604 2.8346 4.1729 3.2390 3.1139 3.5397 2.6172 2.6284 3.9273 1.1276 1.2795 3.5284 3.3332 2.6461 2.7965 3.7777 4.3320 3.2021 2.7312 2.6409 3.1219 3.8213 4.3130 3.6370 5.2468 6.2712 5.1041 4.5119 2.6400 3.0705 1.4260 1.4829 1.7330 4.2825 2.5298 1.6587 1.9952 1.4955 3.6182 1.4966 1.3744 1.6747 1.3956 1.3158 3.1995 1.6331 3.1144 2.2573 2.2255 3.0018 1.6585 1.3096 2.2844 1.5386 1.4519 1.1865 1.2243 1.4145 1.1912 3.4718 1.6806 1.6363 1.3182 2.6912 2.5412 1.2469 1.7936 2.0536 1.3744 1.8921 1.4161 6.6077 4.4642 1.1450 1.9016 1.2832 1.1762 2.8118 1.0583 1.0592 1.0558 1.0763 2.5367 1.0769 2.3680 1.1271 6.6327 7.4786 6.3622 6.7373 1.0579 1.0655 1.0604 1.0694 1.0619 1.0882 1.0744 1.0716 1.0856 1.1033 1.1012 1.1010 1.0877 1.0878 1.0880 1.0882 1.0935 1.0937 1.0988 1.0980
irintensity: 0.3290 0.3020 0.3991 0.1340 0.3555 0.0317 0.4354 1.1402 6.6557 0.0234 0.0799 1.5539 1.0651 5.3133 6.7953 0.1196 0.7742 1.8447 6.9057 2.2385 1.7523 0.4766 0.0407 0.2070 3.0412 10.6265 1.5753 9.5270 4.2881 16.2105 0.1498 23.9177 136.9660 3.1540 8.2999 2.6223 17.3072 4.1348 3.6441 16.4192 0.6446 0.2513 6.1156 1.6419 0.1192 8.4908 26.1961 12.7937 30.6981 31.0942 0.2596 5.2647 6.8202 2.1956 14.0856 17.7656 14.7662 8.2160 26.3921 0.8303 2.3373 1.5661 26.1841 3.9920 11.8499 42.8050 41.0481 9.8212 51.0127 3.1377 103.9527 0.2112 10.1089 8.0723 4.2407 7.5107 4.2731 4.8660 70.2837 11.3151 12.9202 19.0171 18.7783 298.3613 20.7091 29.2959 11.1876 1.7214 13.3927 93.2047 22.5332 70.6899 67.1619 187.9003 33.1912 15.8974 25.1590 32.8194 61.0081 13.0062 15.5221 34.7773 51.0693 0.1500 19.9539 12.3519 12.6233 27.6057 37.7816 23.8378 14.7802
temp: 298.150 k
press: 1.00000 atm
elementType: 7 7 6 6 6 6 6 6 6 6 6 6 6 6 6 6 6 6 6 1 1 1 1 1 1 1 1 1 1 1 1 1 1 1 1 1 1 1 1
symmnumber: 1
zpe: 864795.4 jmol-1
zpe.correction: 0.329383 hartree
zpe.thermalcorrener: 0.346289 hartree
zpe.thermalcorrenthalpy: 0.347234 hartree
zpe.thermalcorrgfe: 0.284115 hartree
zpe.sumelectzpe: -767.919587 hartree
zpe.sumelectthermal: -767.902681 hartree
zpe.sumelectthermalent: -767.901736 hartree
zpe.sumelectthermalfe: -767.964855 hartree
dipole: -1.3868 -0.7500 0.1101
dipole: 1.5804
quadrupole: -98.6618 -109.5074 -118.7146
quadrupole: 3.5723 -0.2609 1.3251
quadrupole: 10.2995 -0.5461 -9.7533 3.5723 -0.2609 1.3251
hfenergy: -768.24897 hartree
pointgroup: C01 [X(C17H20N2)]
dipole: 0.613856 -0.0931423 -0.0334781 debye
polarizability: 227.5890466|-7.564841|264.751089|10.1628984|0.8104937|108.1120136 unknown
InChI: InChI=1S/C17H20N2/c1-18(2)11-12-19-16-9-5-3-7-14(16)13-15-8-4-6-10-17(15)19/h3-10H,11-13H2,1-2H3
charge 0 multiplicity 1
39 atoms
N  0.100225 -0.059458 0.484653
N  3.642892 1.271062 0.026422
C  -0.249616 -1.409994 0.197514
C  -0.819384 0.994546 0.211944
C  1.489478 0.276821 0.848808
C  -2.696898 -0.721088 0.292137
C  -1.623304 -1.763409 0.030396
C  -2.204423 0.693119 0.035616
C  2.410182 0.553832 -0.371761
C  0.740514 -2.42444 0.06333
C  -0.390776 2.349409 0.107854
C  -1.963218 -3.091296 -0.300147
C  -3.104197 1.729314 -0.287212
C  0.375122 -3.753467 -0.236355
C  -1.315752 3.373609 -0.186162
C  -0.979977 -4.098056 -0.432578
C  -2.678289 3.072354 -0.400955
C  4.351623 1.840404 -1.139692
C  4.543879 0.451014 0.864368
H  1.486371 1.1802 1.483558
H  1.88873 -0.544021 1.469242
H  -3.59775 -0.933265 -0.313168
H  -3.019223 -0.798821 1.354869
H  2.633156 -0.403655 -0.908417
H  1.858738 1.194003 -1.084011
H  1.801663 -2.184928 0.170245
H  0.659942 2.617837 0.247031
H  -3.022871 -3.34235 -0.435212
H  -4.163094 1.478703 -0.428968
H  1.157466 -4.515014 -0.331927
H  -0.961336 4.40817 -0.257428
H  -1.265631 -5.125649 -0.679747
H  -3.39448 3.864275 -0.643089
H  5.213908 2.438115 -0.793563
H  3.672725 2.509757 -1.697145
H  4.732679 1.063787 -1.850234
H  4.036227 0.146506 1.795457
H  5.427797 1.049215 1.147842
H  4.9033 -0.473841 0.343485
