program: Gaussian 09
title: 000182174
version: EM64L-G09RevD.01
frameworkgroup: C1[X(C11H14N2O3)]
method: RPBEPBE
basis: SDD
operation: Freq
keyword: #p
keyword: freq=noraman
keyword: PBEPBE/SDD
title: #p freq=noraman PBEPBE/SDD
converged: YES YES NO NO
title: Mulliken charges:
elementType: O O O N N C C C C C C C C C C C H H H H H H H H H H H H H H
charge: -0.428581 -0.215530 -0.292412 -0.369255 -0.519916 -0.143731 -0.564280 0.518007 0.154374 -0.431223 -0.382593 0.240260 -0.226182 -0.254276 -0.524627 -0.245450 0.291479 0.258928 0.214952 0.313030 0.228590 0.262491 0.226301 0.231813 0.224900 0.251020 0.229750 0.389926 0.287588 0.274645
chargesum: 0.00000
title: Mulliken charges with hydrogens summed into heavy atoms:
elementType: O O O N N C C C C C C C C C C C
charge: -0.038655 -0.215530 -0.292412 -0.056225 0.042317 0.147748 -0.090399 0.518007 0.154374 -0.202632 -0.120102 0.240260 0.000119 -0.022463 -0.048707 -0.015700
polarizability: 1.54321149e+02 1.73560999e+01 1.37840874e+02 -5.18627910e+00 1.51396877e+01 1.16533615e+02
1716.lowfreq: -9.1410 -0.0007 0.0001 0.0007 4.3617 10.2914 17.9097 27.9728 32.1487
frequency: 17.5705 27.9020 31.9686 44.7766 70.2664 74.0350 94.5664 130.8816 162.1000 201.4216 217.7749 262.9812 281.9726 304.3530 356.6049 404.8193 411.1238 467.0652 528.4446 537.3679 550.8049 582.5771 602.5814 615.5442 620.5350 662.9134 696.7987 703.0241 739.5136 746.4232 800.0001 853.1443 858.0215 871.9953 893.4531 911.7899 926.9379 977.1411 990.4527 996.9246 1019.8088 1033.0321 1078.5013 1092.5402 1101.9628 1138.9824 1154.2465 1173.1715 1192.7740 1199.3800 1212.7352 1233.6628 1271.0572 1301.8668 1312.6410 1315.0413 1324.3580 1341.2784 1352.8507 1383.3123 1440.1817 1442.0714 1461.1883 1484.6907 1489.6504 1593.8189 1614.8738 1619.4533 1662.8840 1666.4370 2977.8059 2979.4567 3027.7225 3036.0009 3048.3048 3112.6627 3126.5523 3137.1856 3147.8417 3163.9464 3446.6374 3519.3789 3549.2103 3561.8996
redmass: 4.7574 5.1444 2.7581 3.5288 6.7560 3.7313 5.3979 4.2061 5.8694 1.3877 3.5397 3.1423 4.8124 2.8164 4.8098 2.8249 3.4507 2.9806 3.7005 3.5048 3.4916 1.5752 1.7493 3.6261 2.6670 2.4088 3.8601 2.1412 1.4637 2.2543 4.9311 1.4184 3.1095 1.8664 1.5666 4.9232 1.5749 1.4574 4.0503 1.4216 2.9645 2.2428 2.2607 1.7776 3.5453 1.6119 2.1139 1.0586 1.2638 1.3430 2.1162 1.7082 1.5136 1.5391 1.4094 1.4857 1.5090 1.2409 1.2930 5.9700 1.9142 1.1044 1.1945 1.8262 2.1660 5.8757 5.8935 6.4758 1.0841 9.1400 1.0594 1.0600 1.0975 1.1021 1.0870 1.0874 1.0862 1.0914 1.0960 1.1015 1.0459 1.0642 1.0771 1.0954
irintensity: 0.3560 1.5163 0.8556 0.0878 10.7580 1.6662 0.2434 0.9386 0.4628 60.5539 9.9923 29.5058 9.6434 6.3223 18.1933 0.2487 2.5324 8.7482 18.3816 12.7229 6.7454 18.0702 224.2818 23.5482 47.7480 78.4522 35.9222 43.1603 44.9499 265.3862 18.2039 2.5778 26.4703 11.9099 13.0109 24.3943 4.3106 0.1408 0.2070 0.2886 2.0456 9.0504 219.3839 9.1653 24.2645 0.9760 13.7866 0.0201 3.1836 9.8156 3.4182 68.5440 17.2408 32.0090 1.0429 17.7938 8.3474 1.6748 2.5862 0.5935 8.5641 8.4571 53.0625 134.7999 35.6434 1.9105 17.4289 108.0576 35.4334 251.7799 18.0008 28.4931 11.3716 18.6916 11.7490 8.9878 0.1997 16.3429 28.0367 22.4936 1.5884 34.2853 24.4440 2.4498
temp: 298.150 k
press: 1.00000 atm
elementType: 8 8 8 7 7 6 6 6 6 6 6 6 6 6 6 6 1 1 1 1 1 1 1 1 1 1 1 1 1 1
symmnumber: 1
zpe: 626673.5 jmol-1
zpe.correction: 0.238687 hartree
zpe.thermalcorrener: 0.254972 hartree
zpe.thermalcorrenthalpy: 0.255916 hartree
zpe.thermalcorrgfe: 0.191464 hartree
zpe.sumelectzpe: -761.564194 hartree
zpe.sumelectthermal: -761.547909 hartree
zpe.sumelectthermalent: -761.546964 hartree
zpe.sumelectthermalfe: -761.611417 hartree
dipole: -0.1285 -1.3289 -3.3362
dipole: 3.5935
quadrupole: -83.1767 -102.5572 -95.8123
quadrupole: 4.8474 4.9422 10.6457
quadrupole: 10.6720 -8.7085 -1.9635 4.8474 4.9422 10.6457
hfenergy: -761.8028809 hartree
pointgroup: C01 [X(C11H14N2O3)]
dipole: -0.2320247 -0.0615089 -1.3932474 debye
polarizability: 151.84661|21.7648964|128.073346|-3.2546796|15.7786587|128.7756808 unknown
InChI: InChI=1S/C11H14N2O3/c12-7-10(14)13-9(11(15)16)6-8-4-2-1-3-5-8/h1-5,9,13,15H,6-7,12H2
charge 0 multiplicity 1
30 atoms
O  -3.127627 -1.528617 -1.142238
O  -2.302123 -3.18408 0.265379
O  -1.047565 1.104625 1.905513
N  -1.405219 0.323586 -0.261413
N  -2.017294 3.724264 1.234493
C  -1.054202 -1.061778 0.045797
C  0.192288 -1.583294 -0.742804
C  1.454507 -0.742495 -0.582148
C  -2.203014 -2.037501 -0.215839
C  2.337285 -0.609536 -1.684689
C  1.813769 -0.137809 0.650169
C  -1.384618 1.320927 0.701504
C  3.555044 0.096658 -1.562307
C  3.029825 0.571038 0.774098
C  -1.767643 2.734229 0.186282
C  3.907374 0.689294 -0.328173
H  -0.843649 -1.094067 1.130064
H  0.380322 -2.618297 -0.393614
H  -0.066966 -1.655611 -1.817319
H  -1.758267 0.531445 -1.197514
H  2.071061 -1.066405 -2.646543
H  1.143295 -0.195477 1.514957
H  4.223583 0.185235 -2.426188
H  3.288248 1.033783 1.733137
H  -2.658231 2.659779 -0.467812
H  -0.93686 3.090107 -0.454833
H  4.849757 1.239293 -0.228062
H  -3.834666 -2.208887 -1.309989
H  -1.20623 3.844058 1.852447
H  -2.849283 3.50763 1.795242
