program: Gaussian 09
title: 000182166
version: EM64L-G09RevD.01
frameworkgroup: C1[X(C12H17ClN2O)]
method: RPBEPBE
basis: SDD
operation: Freq
keyword: #p
keyword: freq=noraman
keyword: PBEPBE/SDD
title: #p freq=noraman PBEPBE/SDD
converged: YES YES NO NO
title: Mulliken charges:
elementType: Cl O N N C C C C C C C C C C C C H H H H H H H H H H H H H H H H H
charge: -0.082106 -0.315084 -0.506416 -0.164468 -0.200713 0.620253 -0.714449 -0.680384 -0.328367 -0.371932 0.499411 -0.487054 -0.379974 0.302889 -0.631112 -0.670794 0.226377 0.203410 0.218843 0.227742 0.233992 0.211437 0.213004 0.233873 0.241767 0.311798 0.325020 0.225001 0.224891 0.289865 0.249761 0.237191 0.236324
chargesum: 0.00000
title: Mulliken charges with hydrogens summed into heavy atoms:
elementType: Cl O N N C C C C C C C C C C C C
charge: -0.082106 -0.315084 -0.181396 -0.164468 0.025664 0.620253 -0.064454 -0.021950 -0.328367 -0.138059 0.499411 -0.245287 -0.068176 0.302889 0.108646 0.052483
polarizability: 2.48700330e+02 -1.03430754e+00 1.60100263e+02 -3.62610571e-01 1.57706463e-01 9.09803340e+01
1716.lowfreq: -0.0025 -0.0015 -0.0006 1.1740 3.6803 15.2798 31.7784 41.8249 55.0556
frequency: 31.7389 41.7770 54.7869 83.7311 93.1662 95.2508 124.2260 162.0717 164.6296 177.7655 203.0830 211.0685 221.4187 234.6259 255.6914 263.8195 307.1509 364.5396 374.5934 402.4650 417.4205 429.9436 454.6349 500.2511 547.8709 575.4106 606.0165 611.3346 676.2571 703.1348 719.0066 728.0428 846.3210 856.7906 860.3741 868.6639 894.1754 920.3888 957.0823 985.9125 1007.9413 1016.5897 1059.8390 1065.2825 1096.0584 1114.5242 1136.4037 1137.8262 1161.9998 1166.4570 1217.9324 1252.3273 1262.5177 1289.1949 1298.7292 1326.4260 1339.5958 1370.6235 1375.2031 1393.8553 1403.4400 1419.3747 1448.4068 1466.9178 1467.1268 1478.3651 1481.9612 1482.3425 1488.1589 1491.0335 1494.4176 1496.3450 1510.0692 1576.3338 1622.2390 1627.5587 2939.0139 2966.1484 2974.5283 2978.0201 2995.7634 3006.9717 3040.2164 3066.7838 3074.2999 3080.7822 3085.1540 3099.1775 3117.6910 3138.0647 3148.6535 3196.9945 3550.7687
redmass: 3.4898 3.9510 2.9150 2.2233 4.0890 3.4135 1.7192 3.4047 1.2729 3.9013 3.4561 2.8164 1.3202 3.2747 1.6046 1.6200 3.1886 3.6189 3.7644 4.6590 3.6898 3.2257 3.5393 3.8668 1.3336 3.6218 4.1587 3.7407 6.4073 10.9871 3.8765 3.6199 1.4465 6.0326 1.5702 4.7366 2.6880 1.1973 1.4125 1.3131 3.0394 2.6487 1.4179 1.5404 1.2316 2.5141 1.3311 1.8717 2.3676 1.4442 1.5629 3.8253 2.4626 1.7829 1.3713 2.4767 2.0461 2.4687 1.2219 1.3644 3.4229 1.1509 1.1782 1.0480 1.0959 1.2477 1.0461 1.1593 1.1559 1.5161 1.0588 1.2140 2.1595 4.5504 5.0225 5.7066 1.0384 1.0366 1.0348 1.0362 1.0830 1.1019 1.1024 1.0997 1.0992 1.1004 1.0998 1.0941 1.0964 1.0919 1.0895 1.0946 1.0753
irintensity: 4.2092 0.1554 0.0455 8.8716 3.1274 0.7838 0.3651 0.6041 0.1861 0.3478 0.8008 0.8460 0.9661 2.0917 2.4573 1.9994 5.1841 4.3000 10.3010 9.3647 5.7450 3.2492 3.6463 0.6259 75.0535 14.9791 1.0900 0.6625 14.2227 22.2118 0.5450 0.1618 2.0438 2.8806 67.7529 38.0921 7.2790 4.7964 1.4315 2.9058 32.4504 24.1113 20.6166 26.8129 0.0134 24.8790 0.3260 19.7584 230.6046 1.9012 8.6917 47.0754 31.8534 5.1832 2.0026 64.5453 96.7072 177.8561 24.5184 16.8786 40.2237 34.8366 29.2158 4.4851 4.4497 70.4079 24.7136 20.7404 9.2327 8.8704 34.1861 308.3299 369.4603 114.0230 66.0353 285.9157 52.0994 107.5654 33.0142 33.6648 5.4654 39.2406 43.9656 4.0694 85.4218 33.4000 35.2385 18.2654 0.8148 10.1550 9.4881 8.2652 12.7303
temp: 298.150 k
press: 1.00000 atm
elementType: 17 8 7 7 6 6 6 6 6 6 6 6 6 6 6 6 1 1 1 1 1 1 1 1 1 1 1 1 1 1 1 1 1
symmnumber: 1
zpe: 708961.3 jmol-1
zpe.correction: 0.270029 hartree
zpe.thermalcorrener: 0.287742 hartree
zpe.thermalcorrenthalpy: 0.288686 hartree
zpe.thermalcorrgfe: 0.223569 hartree
zpe.sumelectzpe: -1111.068841 hartree
zpe.sumelectthermal: -1111.051128 hartree
zpe.sumelectthermalent: -1111.050184 hartree
zpe.sumelectthermalfe: -1111.115301 hartree
dipole: -3.2135 2.5414 0.0485
dipole: 4.0973
quadrupole: -80.8811 -104.0023 -106.7751
quadrupole: -18.9066 -0.1186 0.2789
quadrupole: 16.3384 -6.7828 -9.5556 -18.9066 -0.1186 0.2789
hfenergy: -1111.3388702 hartree
pointgroup: C01 [X(C12H17Cl1N2O1)]
dipole: -1.2986265 0.9341376 0.198792 debye
polarizability: 248.6554971|1.7734693|157.2471205|1.6206716|13.8370529|93.878309 unknown
InChI: InChI=1S/C12H17ClN2O/c1-8(2)10-6-5-9(7-11(10)13)14-12(16)15(3)4/h5-8,14H,1-4H3
charge 0 multiplicity 1
33 atoms
Cl 2.838657 2.601707 0.367551
O  -2.737136 -1.683538 -0.347434
N  -1.867085 0.474619 0.038686
N  -4.199552 0.113379 0.004535
C  3.912714 -0.340926 -0.170321
C  2.39544 -0.143253 -0.152554
C  4.372936 -1.504406 -1.079495
C  4.445699 -0.53681 1.278339
C  1.7912 1.111441 0.099604
C  1.484619 -1.217424 -0.341024
C  -0.473219 0.209988 -0.032712
C  0.403201 1.311895 0.16139
C  0.084576 -1.070669 -0.286914
C  -2.920577 -0.447062 -0.116668
C  -5.364554 -0.773268 -0.146221
C  -4.439942 1.539289 0.269081
H  4.362597 0.592361 -0.562093
H  4.062134 -2.487092 -0.677823
H  5.476316 -1.513712 -1.144111
H  3.968341 -1.406652 -2.103077
H  4.17478 0.317611 1.923038
H  5.547716 -0.630441 1.274481
H  4.022313 -1.455172 1.726294
H  1.890043 -2.21392 -0.544598
H  0.008659 2.315457 0.356494
H  -0.582801 -1.920011 -0.438384
H  -2.109363 1.448343 0.223553
H  -5.996899 -0.456392 -0.997889
H  -5.980003 -0.779284 0.77392
H  -4.994254 -1.792062 -0.335533
H  -5.526121 1.712569 0.323309
H  -4.047003 2.190456 -0.539091
H  -4.010933 1.866078 1.238966
