program: Gaussian 09
title: 000182164
version: EM64L-G09RevD.01
frameworkgroup: C1[X(C12H17N)]
method: RPBEPBE
basis: SDD
operation: Freq
keyword: #pfreq=noraman
keyword: PBEPBE/SDD
title: #p freq=noraman PBEPBE/SDD
converged: YES YES NO NO
title: Mulliken charges:
elementType: N C C C C C C C C C C C C H H H H H H H H H H H H H H H H H
charge: -0.101256 -0.079322 -0.745645 -0.195829 -0.624322 -0.630205 -0.363452 0.495700 -0.401210 -0.405934 -0.234326 -0.237530 -0.246336 0.181578 0.224274 0.226124 0.232759 0.251141 0.183119 0.218367 0.252070 0.218939 0.185130 0.241687 0.224384 0.226460 0.227043 0.223829 0.224786 0.227977
chargesum: 0.00000
title: Mulliken charges with hydrogens summed into heavy atoms:
elementType: N C C C C C C C C C C C C
charge: -0.101256 0.102257 -0.062488 0.055312 0.029234 0.015551 -0.139068 0.495700 -0.174750 -0.178891 -0.010497 -0.012744 -0.018359
polarizability: 2.21175092e+02 -8.13839560e+00 9.21775810e+01 -4.88245767e+00 -7.57487437e+00 1.22261198e+02
1716.lowfreq: -9.4816 -5.5674 -0.0007 -0.0007 -0.0006 10.5669 27.7338 51.1139 58.2805
frequency: 27.7061 51.0928 58.2290 98.0078 106.7624 202.4579 209.8503 221.3787 241.7406 254.5480 276.2557 325.7317 353.0069 386.2735 404.0325 437.0306 467.7455 527.6820 531.1874 597.2389 616.5522 697.4990 751.2727 768.6868 835.3082 846.3958 870.6060 901.6818 923.0438 969.4608 976.2814 985.6084 988.5162 998.0803 1026.2855 1029.1990 1060.5833 1068.1475 1081.8838 1091.4332 1132.4015 1144.5769 1171.6112 1189.5072 1211.7045 1222.8009 1246.8243 1257.6244 1291.0846 1306.0107 1323.3769 1345.9748 1375.7107 1385.9535 1414.9914 1439.3103 1440.2636 1458.2407 1466.4065 1471.4034 1477.1063 1483.4942 1485.0158 1491.0184 1584.1525 1611.9533 1663.6171 2813.0992 2844.6123 2859.8649 2986.6608 3027.0386 3032.4997 3072.7915 3083.3752 3088.9173 3091.8514 3095.1542 3096.0288 3115.8580 3124.1547 3137.1757 3147.5712 3163.8207
redmass: 3.3538 3.4296 2.9097 3.1622 3.6460 1.3469 1.2763 1.3227 2.2644 1.9355 2.3258 2.2930 3.4257 2.0845 2.7811 2.2355 2.9990 3.0538 3.1680 4.8958 6.4132 1.7196 2.7164 1.9978 3.7930 1.3197 1.7702 1.7618 1.5609 1.8741 1.4032 1.2400 5.6825 1.2492 2.1900 1.5167 1.7185 2.1658 1.5982 1.4929 1.5737 1.9940 1.0622 1.1212 2.2454 2.0742 1.9471 2.0035 1.4181 1.3220 1.4148 1.4360 1.2277 5.2739 1.1381 1.3934 1.7167 1.0481 1.0512 1.0581 1.0673 1.0621 2.1905 1.0531 5.8115 5.9991 6.3106 1.0807 1.0577 1.0576 1.0351 1.0725 1.0726 1.0904 1.1005 1.0997 1.0985 1.0958 1.0922 1.0867 1.0858 1.0912 1.0958 1.1015
irintensity: 0.0461 0.8346 0.9030 0.3652 0.0365 1.0360 0.4765 0.1216 0.3495 0.2072 5.0381 0.6865 5.0914 0.5484 0.0134 0.2646 2.7720 5.5479 9.3995 4.4845 0.0675 44.6557 23.9101 45.0737 2.7195 0.1748 0.1963 19.8540 0.7447 29.6711 0.4746 23.2156 0.1032 18.4553 5.1557 15.9920 38.1652 7.9319 8.6678 21.3154 19.5469 9.4264 0.0507 0.2966 12.7653 0.4912 16.2637 2.3954 7.0020 10.7901 12.9722 16.0743 16.9180 4.6541 2.2469 11.7340 10.5002 8.0842 9.8194 23.3129 2.2305 11.6307 20.8407 14.6914 1.9912 10.4227 0.7475 57.2587 71.4455 217.3758 29.2972 30.8408 55.9653 15.7899 30.0224 30.2214 57.1077 27.7854 22.9148 11.5348 0.5636 13.8667 45.3402 25.8337
temp: 298.150 k
press: 1.00000 atm
elementType: 7 6 6 6 6 6 6 6 6 6 6 6 6 1 1 1 1 1 1 1 1 1 1 1 1 1 1 1 1 1
symmnumber: 1
zpe: 676710.1 jmol-1
zpe.correction: 0.257745 hartree
zpe.thermalcorrener: 0.271477 hartree
zpe.thermalcorrenthalpy: 0.272421 hartree
zpe.thermalcorrgfe: 0.216509 hartree
zpe.sumelectzpe: -521.205749 hartree
zpe.sumelectthermal: -521.192018 hartree
zpe.sumelectthermalent: -521.191074 hartree
zpe.sumelectthermalfe: -521.246985 hartree
dipole: -0.5261 0.1237 -0.7326
dipole: 0.9104
quadrupole: -70.8944 -82.6262 -75.4511
quadrupole: -1.2488 1.9477 -1.6756
quadrupole: 5.4295 -6.3023 0.8728 -1.2488 1.9477 -1.6756
hfenergy: -521.4634947 hartree
pointgroup: C01 [X(C12H17N1)]
dipole: -0.2032415 -0.1471149 0.2556279 debye
polarizability: 221.48613|4.7483062|101.0076014|5.3428907|-15.8246072|113.1201398 unknown
InChI: InChI=1S/C12H17N/c1-11(13(2)3)9-10-12-7-5-4-6-8-12/h4-11H,1-3H3
charge 0 multiplicity 1
30 atoms
N  -3.304242 0.629657 0.039487
C  -2.428564 -0.58308 0.021229
C  -2.899533 -1.607815 -1.043567
C  -1.000342 -0.172472 -0.292839
C  -2.882306 1.601191 1.074323
C  -4.748134 0.333946 0.155793
C  0.090529 -0.552822 0.429477
C  1.506016 -0.233831 0.146911
C  1.921958 0.546154 -0.97121
C  2.510284 -0.720155 1.031395
C  3.285179 0.827584 -1.189358
C  3.87641 -0.440593 0.81342
C  4.271777 0.336533 -0.299177
H  -2.441043 -1.093186 1.02256
H  -3.873239 -2.058391 -0.783205
H  -2.989517 -1.117779 -2.03021
H  -2.160321 -2.423012 -1.125357
H  -0.902004 0.449491 -1.194784
H  -3.007135 1.213217 2.117983
H  -3.480814 2.524681 0.977836
H  -1.81959 1.860591 0.936395
H  -5.305806 1.287443 0.173911
H  -5.013995 -0.234499 1.084146
H  -5.102669 -0.240414 -0.715193
H  -0.080595 -1.163941 1.329766
H  1.175078 0.933556 -1.673057
H  2.210197 -1.323254 1.897813
H  3.583882 1.430474 -2.054665
H  4.630243 -0.826978 1.508726
H  5.3309 0.557205 -0.472351
