program: Gaussian 09
title: 000182144
version: EM64L-G09RevD.01
frameworkgroup: C1[X(C7H4N2OS)]
method: RPBEPBE
basis: SDD
operation: Freq
keyword: #p
keyword: freq=noraman
keyword: PBEPBE/SDD
title: #p freq=noraman PBEPBE/SDD
converged: NO NO NO NO
title: Mulliken charges:
elementType: S O N N C C C C C C C H H H H
charge: 0.639580 -0.228296 -0.427455 -0.391529 0.129502 0.132025 -0.319141 -0.285552 -0.211717 -0.200561 0.111645 0.289552 0.268715 0.245494 0.247738
chargesum: 0.00000
title: Mulliken charges with hydrogens summed into heavy atoms:
elementType: S O N N C C C C C C C
charge: 0.639580 -0.228296 -0.427455 -0.391529 0.129502 0.132025 -0.029589 -0.016836 0.033777 0.047177 0.111645
polarizability: 1.72913261e+02 5.26257961e+00 1.29464678e+02 -1.13716988e-02 7.88219377e-03 4.13407898e+01
1716.lowfreq: -11.7296 0.0011 0.0021 0.0023 12.3052 13.1248 68.3468 150.5233 193.7530
frequency: 68.1187 150.5062 193.7363 286.3294 345.1664 397.5987 418.4030 429.6313 460.9047 516.4480 529.2171 627.6406 658.8342 662.8098 717.8120 766.2016 788.4841 792.2063 878.7020 902.3000 989.8192 1006.7498 1012.4916 1046.8320 1096.8633 1161.8025 1190.3794 1248.6276 1266.6296 1376.6601 1421.6101 1447.6738 1527.3702 1557.0321 1594.7065 3142.6042 3156.1740 3167.7037 3179.2089
redmass: 7.7209 6.0577 7.7559 6.7418 6.3639 12.6162 9.5647 3.8004 13.0764 12.1083 3.8804 7.8314 3.8482 8.2217 10.5978 4.6977 1.4011 11.0187 7.5612 1.4278 1.3636 4.5138 1.3605 2.7911 2.1585 1.3726 1.8575 2.1903 2.3791 7.2509 2.2799 2.7422 6.4915 9.3956 5.9820 1.0867 1.0901 1.0954 1.1002
irintensity: 2.8290 0.1081 0.5810 2.5299 6.7166 4.2479 5.2192 0.0241 2.8718 1.3410 0.2115 6.4642 39.9064 8.7869 10.5872 7.7586 69.3758 14.7554 3.2110 0.0076 2.5857 29.6552 1.2365 29.7769 14.1777 11.2421 12.5499 2.4908 2.9554 8.1656 7.6633 15.3512 56.9382 171.8151 13.7979 4.2977 3.4809 5.1854 15.0115
temp: 298.150 k
press: 1.00000 atm
elementType: 16 8 7 7 6 6 6 6 6 6 6 1 1 1 1
symmnumber: 1
zpe: 252304.3 jmol-1
zpe.correction: 0.096098 hartree
zpe.thermalcorrener: 0.104435 hartree
zpe.thermalcorrenthalpy: 0.105379 hartree
zpe.thermalcorrgfe: 0.062176 hartree
zpe.sumelectzpe: -851.104597 hartree
zpe.sumelectthermal: -851.096259 hartree
zpe.sumelectthermalent: -851.095315 hartree
zpe.sumelectthermalfe: -851.138518 hartree
dipole: -4.5465 -3.3387 0.0009
dipole: 5.6407
quadrupole: -61.3307 -78.7823 -70.6562
quadrupole: -7.0928 -0.0006 0.0016
quadrupole: 8.9257 -8.5259 -0.3998 -7.0928 -0.0006 0.0016
hfenergy: -851.2006944 hartree
pointgroup: C01 [X(C7H4N2O1S1)]
dipole: -1.955787 -1.0487513 0.000354 debye
dipolederiv: 0.2772881 0.0220115 -0.0000258 0.3722813 0.3932871 0.0000463 -0.0001068 -0.0001167 0.2936312 -0.2997913 0.0341633 -0.0000114 -0.3564808 -1.0829569 -0.0002385 -0.0000373 0.0001442 -0.3605421 0.2000942 -0.1300606 -0.0000792 -0.1189015 -0.383156 -0.0000246 0.0000644 0.000044 -0.2539803 -0.1489183 0.5578363 0.0000105 -0.5915718 -0.3582138 0.0000991 -0.0000727 -0.000085 -0.2934779 -0.1498883 -0.2439656 0.000058 -0.4638615 -0.1901544 0.0000028 -0.0000259 0.0000208 0.0341267 -0.1129618 -0.0486539 0.0000191 0.2756533 -0.0099693 -0.0000178 -0.0000511 -0.0000317 0.1121719 -0.454722 0.2186265 0.0000617 0.0042146 0.0599444 0.0000312 0.0000346 -0.0000035 -0.1131324 0.0344039 0.0093503 -0.0000144 0.1477167 0.1642588 0.0000103 -0.0000214 0.0000255 -0.1011028 0.1777246 -0.2288529 -0.0000223 -0.0068655 0.0505371 -0.0000032 0.0000125 -0.0000049 -0.1166216 0.2004001 0.0860975 -0.0000113 0.1719562 -0.0403544 -0.0000047 -0.0000048 0.0000028 -0.1401492 0.1689716 -0.2514376 -0.0000079 0.5361416 1.2735875 0.0001467 0.0001661 0.0000414 0.2937308 0.0933726 -0.0658332 -0.0000086 0.0252866 0.0319639 -0.0000222 -0.0000041 -0.0000106 0.1583262 0.1075315 0.0147889 0.0000102 -0.0320981 -0.0142113 -0.0000123 0.0000356 -0.0000382 0.1632735 -0.0101748 0.0846848 0.0000132 0.0937815 0.0216556 -0.0000093 0.0000082 0.0000139 0.1624668 -0.0833301 -0.0587552 0.0000081 -0.0572526 0.0837815 -0.0000039 0.0000026 -0.000002 0.161279 unknown
polarizability: 173.5192558|-0.9989568|128.8586832|-0.0101494|0.009404|41.3407898 unknown
InChI: InChI=1S/C7H4N2OS/c10-7-5-3-1-2-4-6(5)8-11-9-7/h1-4H
charge 0 multiplicity 1
15 atoms
S  2.291506 -1.490911 -0.000515
O  1.537116 2.325281 -0.000166
N  0.636785 -1.975599 -0.00032
N  2.498776 0.216416 -0.000039
C  -0.031298 0.472532 0.000207
C  -0.316189 -0.953281 0.000017
C  -1.123968 1.372673 0.000251
C  -1.677723 -1.406463 0.000041
C  -2.454494 0.909677 0.000231
C  -2.732724 -0.486435 0.000162
C  1.347936 1.072936 0.000464
H  -0.892664 2.442706 0.000349
H  -1.847638 -2.48734 -0.000045
H  -3.280354 1.629159 0.000286
H  -3.768465 -0.840849 0.000177
