program: Gaussian 09
title: 000196209
version: EM64L-G09RevD.01
frameworkgroup: C1[X(C21H22N2O8S2)]
method: RPBEPBE
basis: SDD
operation: Freq
keyword: #p
keyword: freq=noraman
keyword: PBEPBE/SDD
title: #p freq=noraman PBEPBE/SDD
converged: NO YES NO NO
title: Mulliken charges:
elementType: S S O O O O O O O O N N C C C C C C C C C C C C C C C C C C C C C H H H H H H H H H H H H H H H H H H H H H H
charge: 0.092255 0.079479 -0.284915 -0.141397 -0.453885 -0.249199 -0.252096 -0.423263 -0.338655 -0.291658 -0.090158 -0.152925 0.388208 -0.268146 -0.272340 -0.535626 -0.290970 -0.132337 -0.179282 -0.218146 0.295191 -0.170199 0.219314 -0.669286 -0.627449 0.493977 -0.060688 -0.327961 0.046179 -0.397999 0.246796 -0.524508 -0.530152 0.260395 0.304856 0.280565 0.277828 0.226378 0.233799 0.263945 0.269352 0.372345 0.382249 0.236276 0.281505 0.241949 0.296671 0.258405 0.385468 0.233634 0.264342 0.235784 0.250799 0.236173 0.229123
chargesum: 0.00000
title: Mulliken charges with hydrogens summed into heavy atoms:
elementType: S S O O O O O O O O N N C C C C C C C C C C C C C C C C C C C C C
charge: 0.092255 0.079479 -0.284915 -0.141397 -0.071636 -0.249199 -0.252096 -0.037796 -0.338655 -0.291658 -0.090158 -0.152925 0.388208 -0.007751 0.032515 0.022767 -0.290970 0.094041 0.054518 0.045800 0.295191 0.099153 0.219314 -0.296941 0.132281 0.493977 -0.060688 -0.031290 0.046179 -0.139594 0.246796 0.209252 0.185943
polarizability: 4.43143011e+02 -3.10933092e+01 2.85350432e+02 2.76045296e+00 5.90916503e+00 2.11078109e+02
1716.lowfreq: 0.0012 0.0013 0.0019 2.2279 2.8923 8.4995 19.6579 29.4101 34.2125
frequency: 19.6244 29.3215 34.1981 44.3788 55.5569 72.9701 83.9955 98.8914 102.9815 107.0169 113.2759 119.6320 135.2904 137.7774 141.5789 149.2911 155.4149 159.9121 163.9631 180.5392 192.0848 198.4798 235.0962 236.5041 251.2752 279.2667 297.5614 300.6340 303.8952 319.2146 329.3371 332.9183 347.9120 372.0493 376.5798 382.1079 396.7903 399.1226 412.0950 416.4355 422.0546 445.5373 457.7562 466.1284 482.2567 494.7620 515.4912 529.4099 544.8436 567.5889 576.2196 592.3942 593.1359 610.8120 615.5426 625.0023 629.6421 653.7041 663.3314 684.3376 709.5271 721.0240 741.2571 756.4202 759.2184 765.8129 781.6132 809.4994 833.2396 836.2510 863.5378 910.5875 912.8887 920.0371 941.5865 957.1662 964.0950 969.2184 971.1993 981.5462 986.8941 992.4100 1019.3353 1041.1945 1045.5255 1056.7587 1061.5576 1092.7164 1113.4571 1118.9666 1120.2682 1123.2114 1140.6905 1152.0532 1155.1983 1169.1593 1176.7056 1180.1520 1191.4484 1197.1248 1199.4331 1206.3590 1216.9313 1233.3903 1245.7007 1248.5393 1250.3077 1267.9193 1281.4585 1295.4323 1302.7553 1320.3970 1325.4765 1331.0958 1340.0655 1349.3999 1393.0844 1398.0211 1403.5811 1413.0706 1419.9441 1427.8756 1429.1439 1443.2724 1443.6583 1456.4226 1460.7348 1474.9951 1481.7050 1484.5854 1487.0734 1488.9090 1578.4140 1601.1728 1613.1156 1616.2080 1644.7765 2920.5954 2976.6717 2978.5537 2985.0896 3036.8703 3038.0246 3060.4481 3070.3177 3072.7590 3086.7025 3088.1113 3107.2812 3120.2275 3120.7538 3126.9517 3132.0651 3139.6486 3143.7723 3167.3324 3174.3291 3455.2046 3466.1784
redmass: 5.1716 6.0258 5.8223 5.8866 6.0383 4.2236 6.1761 5.9421 4.0945 3.8942 4.4611 6.3726 3.3683 5.1152 1.2583 2.2317 1.9048 1.0930 6.3749 4.5778 4.1467 7.7038 6.7501 6.4431 5.2838 5.9839 5.1145 5.0252 5.7980 6.6239 6.5337 6.0185 3.3175 7.5114 5.0876 5.2139 5.8124 6.0372 13.8700 5.1330 6.1297 6.9121 6.9661 6.0672 5.7994 6.7645 7.8608 1.4180 2.5590 5.7095 5.3347 6.8430 1.1253 5.6876 5.4998 5.6906 5.1766 7.2052 4.8330 2.7268 5.1904 4.7576 5.7353 3.6383 5.8854 6.0758 5.4101 3.5451 3.2169 1.6355 4.8564 6.2717 7.0975 4.6326 4.1098 3.5042 2.3127 1.9813 1.4285 2.7047 4.4260 1.8385 5.2332 2.4943 4.2188 2.5720 2.6104 2.2567 1.2407 1.2426 2.2006 1.3914 1.4351 1.3161 1.3481 1.5603 1.4651 2.2728 2.0377 1.7276 2.0516 2.1998 2.2681 1.1674 2.8546 1.9780 2.2772 1.2960 1.3305 2.0725 1.4301 1.3681 1.4602 1.7199 3.9029 1.4899 4.4384 1.6384 1.7021 2.2074 4.1681 1.3919 1.2515 1.5619 1.0943 1.0580 1.0686 1.0736 1.0450 1.1642 1.0569 2.6276 8.2155 9.8807 8.3009 6.5588 7.5151 1.0796 1.0306 1.0351 1.0304 1.0603 1.0855 1.1022 1.0857 1.1046 1.0867 1.1043 1.1033 1.0986 1.0895 1.1027 1.1043 1.0872 1.0911 1.1007 1.0950 1.0638 1.0662
irintensity: 0.2007 0.2118 0.4170 0.1545 0.2565 2.5448 0.9916 2.6646 5.3280 5.1383 3.0611 1.3303 0.5368 3.2067 0.2553 1.0352 0.2325 0.1224 7.7084 1.8567 3.0710 0.7070 4.4196 11.7163 5.3331 2.9826 5.6319 5.9315 8.6246 4.1693 4.0220 2.1260 6.4883 4.9709 1.0001 19.4335 0.3551 3.7753 3.9140 9.7055 11.3071 8.2444 0.2538 15.3506 7.2956 10.3721 26.6461 69.0683 70.9221 1.3966 2.8313 26.2059 106.0655 4.3163 15.0136 8.0355 12.6372 15.1741 26.6635 10.3110 2.9093 5.6683 1.1836 23.8948 8.2657 0.1909 55.3736 25.5090 4.4681 36.9076 6.5117 37.8859 33.0713 22.2986 15.4797 4.7829 6.1093 7.1465 3.4241 19.5610 119.2013 9.7545 114.0521 49.2226 35.2601 29.9829 20.0942 3.3240 12.3124 7.6861 7.6251 2.9032 5.7527 0.6912 7.3848 16.5387 1.8333 26.3228 66.3378 22.8710 42.0463 39.9022 27.1620 59.0735 131.1969 15.5613 12.1423 33.1087 1.3716 30.5806 6.7469 2.4264 29.7248 77.6880 86.8399 33.9632 16.4434 20.6839 11.9825 84.3450 9.6320 65.2920 15.9748 60.6263 26.4620 21.8908 0.8717 17.8636 18.1864 14.0391 30.5476 63.6111 6.7680 136.1279 159.0106 235.2739 3.5724 39.4585 74.3227 40.6353 58.4551 1.5729 5.3544 20.4900 2.4529 25.7113 0.1063 20.8379 0.5915 0.5533 7.9842 24.0822 18.0960 4.3113 8.0890 19.1336 6.0142 94.4299 62.8768
temp: 298.150 k
press: 1.00000 atm
elementType: 16 16 8 8 8 8 8 8 8 8 7 7 6 6 6 6 6 6 6 6 6 6 6 6 6 6 6 6 6 6 6 6 6 1 1 1 1 1 1 1 1 1 1 1 1 1 1 1 1 1 1 1 1 1 1
symmnumber: 1
zpe: 1070285.6 jmol-1
zpe.correction: 0.407650 hartree
zpe.thermalcorrener: 0.439095 hartree
zpe.thermalcorrenthalpy: 0.440040 hartree
zpe.thermalcorrgfe: 0.345575 hartree
zpe.sumelectzpe: -2318.276256 hartree
zpe.sumelectthermal: -2318.244811 hartree
zpe.sumelectthermalent: -2318.243867 hartree
zpe.sumelectthermalfe: -2318.338331 hartree
dipole: -7.1435 -0.5226 4.4290
dipole: 8.4213
quadrupole: -173.7418 -221.3654 -204.9880
quadrupole: 4.8384 5.2987 7.4343
quadrupole: 26.2899 -21.3336 -4.9562 4.8384 5.2987 7.4343
hfenergy: -2318.6839066 hartree
pointgroup: C01 [X(C21H22N2O8S2)]
dipole: -2.8062508 -0.3465388 1.7269209 debye
polarizability: 441.1274521|-35.7319902|284.5652006|-2.9221468|15.6146706|213.8788997 unknown
InChI: InChI=1S/C21H22N2O8S2/c1-22-13-16(9-4-6-11(28-2)15(29-3)14(9)25)32-33-21(19(22)27)8-20-12(30-20)7-5-10(24)17(20)31-23(21)18(13)26/h4-7,10,12-13,16-17,24-25H,8H2,1-3H3
charge 0 multiplicity 1
55 atoms
S  0.901308 -2.438424 -1.683686
S  -0.843715 -1.014159 -1.869234
O  5.941721 -0.704747 -1.038232
O  2.64786 0.867539 -1.585755
O  3.530168 3.200041 0.043441
O  2.516759 -2.675849 1.426384
O  0.619226 2.033672 -0.095637
O  -3.815109 -2.106263 0.266141
O  -6.211718 -0.857097 0.208769
O  -6.301808 2.100622 -0.037265
N  1.810077 0.111616 -0.685052
N  0.716619 -1.182454 1.481161
C  4.518403 -0.455909 -0.631586
C  5.546529 -0.569199 0.45534
C  4.000945 0.963631 -0.930761
C  3.552445 -1.580453 -1.014583
C  2.104494 -1.294429 -0.56192
C  3.917298 1.831053 0.346041
C  6.007677 0.681184 1.124368
C  5.259786 1.8160 1.051075
C  1.805875 -1.784493 0.877848
C  -0.116015 -0.162625 0.79371
C  0.777684 0.779377 -0.05238
C  -1.303365 -0.802021 -0.003139
C  0.265966 -1.634594 2.810037
C  -2.59139 -0.015225 0.004823
C  -3.819253 -0.717073 0.122999
C  -2.643499 1.397706 -0.145845
C  -5.059309 -0.031877 0.09496
C  -3.872362 2.088238 -0.142975
C  -5.089073 1.380909 -0.005724
C  -7.11065 -0.814142 -0.977905
C  -7.136769 1.978377 1.182936
H  5.646912 -1.521346 0.989691
H  4.612312 1.466456 -1.698046
H  3.870147 -2.53468 -0.56455
H  3.568388 -1.674114 -2.11397
H  3.167115 1.367088 1.027628
H  6.964744 0.66333 1.657085
H  5.573223 2.760016 1.509813
H  -0.544965 0.483967 1.580806
H  -1.480843 -1.825566 0.363523
H  2.575759 3.183131 -0.24506
H  0.295275 -0.80046 3.53487
H  0.942769 -2.43501 3.146103
H  -0.765725 -2.029871 2.758378
H  -1.710041 1.961679 -0.247718
H  -3.912328 3.176663 -0.240107
H  -4.764563 -2.399927 0.354596
H  -6.574758 -1.178078 -1.873678
H  -7.467325 0.216012 -1.147875
H  -7.949998 -1.482361 -0.734339
H  -7.377912 0.922032 1.399038
H  -8.052353 2.548467 0.966119
H  -6.608938 2.42604 2.045537
