program: Gaussian 09
title: 000196621
version: EM64L-G09RevD.01
frameworkgroup: C1[X(C20H28NO2P)]
method: RPBEPBE
basis: SDD
operation: Freq
keyword: #p
keyword: freq=noraman
keyword: PBEPBE/SDD
title: #p freq=noraman PBEPBE/SDD
converged: YES YES NO NO
title: Mulliken charges:
elementType: P O O N C C C C C C C C C C C C C C C C C C C C H H H H H H H H H H H H H H H H H H H H H H H H H H H H
charge: 1.019081 -0.551804 -0.557631 -0.606758 -0.025234 0.048723 -0.653574 -0.722666 -0.686374 -0.706274 -0.464427 -0.363843 0.493852 0.424337 -0.368482 -0.421300 -0.403822 -0.392895 -0.234000 -0.221418 -0.225148 -0.218548 -0.240082 -0.244763 0.213326 0.187362 0.206847 0.216104 0.221715 0.250785 0.216670 0.224582 0.200582 0.259658 0.201491 0.215255 0.198975 0.266088 0.206350 0.215028 0.233214 0.217792 0.277836 0.230148 0.231916 0.270012 0.235420 0.223459 0.225782 0.222790 0.228573 0.225289
chargesum: 0.00000
title: Mulliken charges with hydrogens summed into heavy atoms:
elementType: P O O N C C C C C C C C C C C C C C C C C C C C
charge: 1.019081 -0.551804 -0.557631 -0.606758 0.188092 0.236085 -0.008908 -0.030628 -0.024642 -0.025956 -0.043049 0.087163 0.493852 0.424337 -0.090645 -0.191152 -0.171906 -0.122883 0.001420 0.002041 0.000634 0.004242 -0.011509 -0.019475
polarizability: 2.99462266e+02 1.40842302e+01 2.64009331e+02 -1.73784178e+01 2.85958938e+01 1.91766722e+02
1716.lowfreq: -12.7394 -8.9628 -3.9949 -0.0013 -0.0011 -0.0007 1.8998 10.1540 19.9545
frequency: -8.7135 6.7682 19.4874 27.0266 34.7986 44.0093 56.2066 65.5223 85.5086 98.5666 106.9090 129.1672 134.3425 155.1514 181.8285 211.0992 216.4687 223.8965 227.7114 237.0018 269.6837 275.9858 278.5636 302.2598 315.8770 320.6641 330.8312 371.1840 376.2254 393.4764 402.0390 406.3236 461.3313 465.4501 480.8777 487.6433 530.2855 558.8913 569.5662 580.7576 614.8252 617.0633 634.4612 647.6953 702.9195 708.2877 741.3860 760.8550 804.4645 813.4058 825.1686 857.5904 862.5781 869.7820 906.9696 909.6196 910.2908 918.0003 921.7031 932.7870 936.4340 946.9800 963.2235 972.0612 979.8807 984.9768 989.1722 990.6427 993.0113 1004.4049 1009.7075 1025.6330 1026.6159 1027.1599 1079.5675 1090.4234 1107.2399 1130.7414 1141.5505 1169.4167 1172.2949 1172.5633 1180.2422 1181.6988 1189.3547 1197.5897 1203.1780 1213.3791 1218.6070 1221.1819 1301.3777 1309.4502 1313.0512 1325.7290 1328.5691 1344.4701 1348.8353 1364.5479 1374.5808 1381.4615 1385.2970 1386.7244 1388.9458 1396.9380 1435.3402 1440.0393 1453.7894 1460.3256 1462.2843 1464.3736 1469.6343 1473.8187 1479.7802 1482.1602 1483.5131 1484.8463 1486.6252 1501.1873 1592.7012 1593.9523 1614.0857 1614.7581 2944.0750 2960.9657 2970.7751 2971.1471 2975.0670 2981.4317 2983.4458 2986.1198 3005.4053 3046.6180 3068.8746 3071.6517 3076.0004 3078.1222 3085.0082 3096.9297 3105.2905 3111.9976 3112.5427 3117.9686 3123.5363 3123.9840 3134.1876 3136.9462 3146.2302 3154.8487 3162.0827 3168.1871
redmass: 3.9754 4.8079 4.2411 4.1758 2.7147 3.7997 4.1977 5.3630 4.1213 2.9283 3.7045 3.9026 4.4687 4.6498 3.7985 2.9003 1.1798 2.6765 1.2583 2.0507 1.6136 1.2560 2.4565 3.2332 2.1832 2.7189 4.7902 3.3632 2.7817 3.4304 2.8575 2.8739 3.9062 3.0534 2.8251 3.5752 2.8046 5.9074 4.9618 3.9342 6.4207 6.2477 7.0479 8.0150 2.2671 1.8299 1.4133 2.0319 4.2565 3.4920 3.1599 1.2497 1.2484 2.3756 3.1511 1.4143 1.2938 1.2088 1.7121 1.4281 1.6863 1.9139 6.3370 1.7452 1.3850 1.3974 5.4285 5.3292 1.4440 1.3334 1.6813 2.1346 2.2069 2.6453 1.5759 1.5256 1.7596 2.2794 2.3021 1.0649 1.0648 2.2790 2.1706 1.1748 1.1216 2.1652 1.1732 2.2119 1.1239 2.7755 1.4302 1.3378 1.3641 1.1838 1.2661 1.3918 1.2422 1.2149 1.2109 1.2159 7.0767 5.1992 1.2157 1.2091 2.1166 2.1570 1.0525 1.0793 1.0499 1.0566 1.1164 1.0600 1.1015 1.3787 1.3506 2.1666 1.0936 1.0542 6.1065 6.0383 6.0104 6.0210 1.0575 1.0836 1.0647 1.0797 1.0357 1.0360 1.0365 1.0382 1.1016 1.1033 1.0997 1.0987 1.0988 1.0980 1.0997 1.0993 1.1004 1.0865 1.0991 1.0860 1.0870 1.0874 1.0921 1.0932 1.0963 1.0973 1.1015 1.0976
irintensity: 0.0843 0.0157 0.2636 0.1482 0.1129 0.6931 0.9785 0.6241 0.2672 0.5253 1.1987 1.3781 2.4408 4.6641 2.1847 12.4044 0.8233 0.5403 0.2392 4.6880 0.8523 1.0530 4.9899 1.1082 0.3678 1.3412 14.0954 8.3249 0.6124 2.9689 0.2518 0.1055 23.7192 4.7021 13.1911 10.8399 1.1179 50.1669 24.2458 13.4635 0.3185 0.5781 80.7190 104.9836 32.5984 44.2892 81.5433 90.6274 2.0675 8.5238 9.9914 0.3766 0.0281 16.5102 238.4240 18.7743 9.3650 2.5278 29.9815 1.5655 21.2078 30.9788 119.4327 7.8831 0.5514 2.1043 0.0226 0.3544 0.5932 1.4945 3.4983 7.5926 2.1319 24.1239 10.3614 7.2823 49.2823 3.4240 22.1836 2.5322 1.6328 107.6318 57.0022 5.8286 0.2181 24.2069 2.4575 1.3439 1.2899 21.3567 6.0697 3.1876 9.7784 19.4024 3.2426 3.8232 16.0266 14.2647 28.6917 23.8549 0.3600 1.9754 10.3189 16.4013 9.3141 11.1389 3.5797 18.0018 4.2368 4.2396 8.4902 2.4750 17.5115 11.1086 20.0354 9.1534 5.6672 3.1274 1.3018 0.6803 0.8263 14.0602 20.7685 14.3389 79.3124 16.7006 24.1024 38.2865 16.3414 46.2166 23.4624 22.8242 2.9560 23.2963 100.5991 69.2260 22.5032 28.6974 8.5637 8.4630 23.7599 4.2873 0.9873 1.1863 10.8348 34.3052 32.6903 35.6857 26.4054 11.6450
temp: 298.150 k
press: 1.00000 atm
elementType: 15 8 8 7 6 6 6 6 6 6 6 6 6 6 6 6 6 6 6 6 6 6 6 6 1 1 1 1 1 1 1 1 1 1 1 1 1 1 1 1 1 1 1 1 1 1 1 1 1 1 1 1
symmnumber: 1
zpe: 1141003.0 jmol-1
zpe.correction: 0.434585 hartree
zpe.thermalcorrener: 0.459930 hartree
zpe.thermalcorrenthalpy: 0.460874 hartree
zpe.thermalcorrgfe: 0.376235 hartree
zpe.sumelectzpe: -1323.528736 hartree
zpe.sumelectthermal: -1323.503391 hartree
zpe.sumelectthermalent: -1323.502447 hartree
zpe.sumelectthermalfe: -1323.587086 hartree
dipole: 1.2871 0.1992 1.0019
dipole: 1.6432
quadrupole: -140.3399 -144.8876 -150.3371
quadrupole: -2.5492 -3.1180 2.2642
quadrupole: 4.8483 0.3006 -5.1489 -2.5492 -3.1180 2.2642
hfenergy: -1323.9633215 hartree
pointgroup: C01 [X(C20H28N1O2P1)]
dipole: 0.1432458 -0.5756046 0.2571192 debye
polarizability: 272.1474824|-10.3024598|288.1235081|8.4473699|40.8814548|194.967329 unknown
InChI: InChI=1S/C20H28NO2P/c1-17(2)21(18(3)4)24(22-15-19-11-7-5-8-12-19)23-16-20-13-9-6-10-14-20/h5-14,17-18H,15-16H2,1-4H3
charge 0 multiplicity 1
52 atoms
P  -0.364925 -1.53827 -1.377184
O  1.386166 -1.274679 -1.10625
O  -1.045715 -0.042509 -0.647757
N  -0.560401 -2.812684 -0.158446
C  -1.849341 -3.589314 -0.23903
C  0.502518 -3.42467 0.7136
C  -1.749889 -4.814517 -1.185029
C  -3.066677 -2.709533 -0.610717
C  1.080302 -2.439717 1.755875
C  1.636965 -4.125514 -0.080231
C  2.047667 -0.315127 -2.040303
C  -0.908597 0.290321 0.777562
C  2.579788 0.888918 -1.28965
C  -1.777696 1.492596 1.105145
C  1.710085 1.942179 -0.90295
C  -1.485682 2.271395 2.254172
C  3.955418 0.977123 -0.959939
C  -2.894206 1.837729 0.305374
C  2.208021 3.058447 -0.196499
C  -2.304982 3.366887 2.607665
C  4.457107 2.095237 -0.25458
C  -3.711471 2.936827 0.655971
C  3.583558 3.13888 0.128743
C  -3.423671 3.702883 1.809438
H  -2.025733 -3.962259 0.790833
H  -0.039506 -4.213646 1.276505
H  -2.696503 -5.387407 -1.182035
H  -1.547995 -4.483132 -2.220683
H  -0.93774 -5.4953 -0.875992
H  -3.139471 -1.823959 0.04342
H  -3.990976 -3.305631 -0.499924
H  -3.021581 -2.360713 -1.658973
H  1.793917 -2.971942 2.412685
H  1.615055 -1.616554 1.254718
H  0.278832 -2.020316 2.389756
H  1.226565 -4.835665 -0.819594
H  2.290147 -4.687423 0.614417
H  2.244236 -3.376111 -0.611751
H  1.329565 -0.004942 -2.826587
H  2.871835 -0.878128 -2.51494
H  0.152473 0.506029 1.013485
H  -1.216984 -0.59079 1.380573
H  0.643565 1.876674 -1.150916
H  -0.612582 2.023772 2.871737
H  4.634835 0.167662 -1.254942
H  -3.095378 1.248773 -0.59457
H  1.524625 3.863135 0.097354
H  -2.068108 3.960121 3.498485
H  5.523196 2.153052 -0.007204
H  -4.571288 3.196914 0.027505
H  3.970341 4.007215 0.674242
H  -4.058183 4.55468 2.079718
