program: Gaussian 09
title: 000182137
version: EM64L-G09RevD.01
frameworkgroup: C1[X(C13H16ClNO)]
method: RPBEPBE
basis: SDD
operation: Freq
keyword: #p
keyword: freq=noraman
keyword: PBEPBE/SDD
title: #p freq=noraman PBEPBE/SDD
converged: YES YES NO NO
title: Mulliken charges:
elementType: Cl O N C C C C C C C C C C C C C H H H H H H H H H H H H H H H H
charge: -0.035763 -0.200310 -0.399400 0.143922 -0.518847 -0.392026 -0.415416 0.101213 -0.492393 0.636941 -0.376971 -0.390162 -0.647071 -0.239040 -0.265345 -0.239598 0.217048 0.235847 0.221383 0.205426 0.220118 0.216465 0.240152 0.233792 0.311991 0.246168 0.225365 0.198316 0.234807 0.255911 0.231409 0.236066
chargesum: 0.00000
title: Mulliken charges with hydrogens summed into heavy atoms:
elementType: Cl O N C C C C C C C C C C C C C
charge: -0.035763 -0.200310 -0.087409 0.143922 -0.065951 0.034783 0.021167 0.101213 -0.018449 0.636941 -0.376971 -0.143994 0.011417 0.016871 -0.033935 -0.003532
polarizability: 1.72054137e+02 1.01603437e+01 1.60153024e+02 1.14352845e+01 1.59531269e+00 1.25073264e+02
1716.lowfreq: -13.5021 -0.0014 0.0020 0.0024 4.0189 7.2556 48.1691 76.0064 92.8151
frequency: 48.0971 75.9854 92.7923 133.6347 140.3430 151.8599 164.3299 166.3486 197.7815 233.4156 266.2531 308.7603 332.8216 341.0201 372.3389 392.3400 405.8486 433.0976 463.6163 471.6989 490.5733 529.7569 574.9488 594.2157 646.9050 691.8587 701.4883 738.5316 761.3726 795.3531 842.8466 853.0500 871.7999 890.7513 916.1218 944.4490 953.8642 985.0841 995.3681 1018.9189 1036.9725 1040.1572 1070.5095 1085.1926 1108.9724 1114.5000 1124.3871 1129.9371 1159.7863 1174.6237 1185.9110 1214.8585 1225.6166 1243.2546 1251.4051 1275.2600 1295.1082 1318.4435 1334.2024 1341.0330 1361.3362 1418.5343 1438.6736 1444.9299 1452.3116 1457.1716 1467.0968 1469.8575 1472.2103 1484.1434 1499.4243 1568.6079 1597.1756 1618.6816 2881.0677 2982.0740 2985.6407 2989.8947 2995.7422 3010.7021 3035.0415 3041.7062 3056.2277 3066.2440 3092.2448 3133.0716 3148.5283 3160.5974 3173.8742 3488.4789
redmass: 6.6846 3.7579 2.8787 4.0018 7.6251 3.2777 3.0484 2.2718 1.6964 2.7644 3.4398 6.7277 3.3418 3.5618 3.1789 2.7971 3.0937 5.0344 2.9311 2.0567 3.4147 1.9567 3.5451 3.2777 5.6073 2.9464 5.1231 3.6293 1.2991 1.6617 2.3960 2.2798 1.5678 2.0655 2.1328 1.5971 1.7079 1.3314 2.7698 5.3408 2.7022 2.7493 1.7615 1.9464 1.9516 1.2644 1.3842 1.5351 2.2379 1.0749 3.1581 1.8432 2.2105 1.3482 1.4871 1.6917 1.2880 1.4204 1.4266 1.4303 8.2603 2.0962 1.1404 1.4155 1.1149 2.0116 1.0866 1.0908 1.0830 1.1020 1.0490 5.7470 6.9907 8.2590 1.0551 1.0593 1.0604 1.0644 1.0783 1.0619 1.0991 1.1009 1.1022 1.0967 1.1030 1.0853 1.0897 1.0944 1.0999 1.0757
irintensity: 0.0586 0.5341 4.4301 0.9509 0.6979 0.1090 1.3382 2.0041 1.4779 1.7030 1.5560 8.1632 3.0850 11.3670 4.8018 0.1028 15.2473 14.2974 8.5544 16.2422 18.9908 19.3703 22.5090 1.8048 6.4418 10.0159 25.2903 12.8333 63.3917 15.7186 8.5390 0.7136 0.0292 12.4638 8.6726 1.8726 5.0251 0.1827 18.6937 34.8575 5.8423 16.6509 15.4828 1.4178 25.2996 2.0546 3.6552 2.0997 11.7309 1.1064 33.5657 14.2128 13.7108 3.2947 14.6089 15.4515 13.1743 3.9231 1.2448 0.7804 4.9234 18.0203 1.4405 30.4673 17.2099 32.2654 10.3606 7.2468 13.9813 9.9963 26.1317 4.8561 1.6113 127.4933 135.6508 16.8761 40.1649 36.5565 43.3397 11.8175 23.1970 39.4924 54.0571 33.4680 22.8106 1.4335 11.4751 16.5221 13.7996 41.7175
temp: 298.150 k
press: 1.00000 atm
elementType: 17 8 7 6 6 6 6 6 6 6 6 6 6 6 6 6 1 1 1 1 1 1 1 1 1 1 1 1 1 1 1 1
symmnumber: 1
zpe: 686124.5 jmol-1
zpe.correction: 0.261331 hartree
zpe.thermalcorrener: 0.276531 hartree
zpe.thermalcorrenthalpy: 0.277475 hartree
zpe.thermalcorrgfe: 0.219677 hartree
zpe.sumelectzpe: -1093.806143 hartree
zpe.sumelectthermal: -1093.790943 hartree
zpe.sumelectthermalent: -1093.789999 hartree
zpe.sumelectthermalfe: -1093.847797 hartree
dipole: -1.0630 -4.1287 -1.1972
dipole: 4.4282
quadrupole: -97.0041 -103.5384 -98.9067
quadrupole: -3.9919 0.1533 -2.3255
quadrupole: 2.8123 -3.7220 0.9097 -3.9919 0.1533 -2.3255
hfenergy: -1094.067474 hartree
pointgroup: C01 [X(C13H16Cl1N1O1)]
dipole: -0.4310732 1.6346593 -0.4211009 debye
polarizability: 170.4981794|-16.2251152|152.2783859|-7.8410028|-13.5817815|134.5038599 unknown
InChI: InChI=1S/C13H16ClNO/c1-15-13(9-5-4-8-12(13)16)10-6-2-3-7-11(10)14/h2-3,6-7,15H,4-5,8-9H2,1H3
charge 0 multiplicity 1
32 atoms
Cl -0.826937 -2.043226 1.56097
O  2.330422 -1.840788 0.396374
N  0.550205 -1.384088 -1.550267
C  0.739102 -0.276297 -0.618851
C  1.62354 0.902653 -1.212214
C  1.97695 2.002355 -0.182202
C  2.723544 1.416209 1.038726
C  1.66778 -0.777317 0.532474
C  1.930404 0.215761 1.650225
C  -0.650676 0.212923 -0.140236
C  -1.456759 -0.518433 0.771641
C  -1.260429 1.365626 -0.707935
C  0.031865 -1.162104 -2.895758
C  -2.765519 -0.138028 1.12273
C  -2.57472 1.76643 -0.383918
C  -3.33339 1.016677 0.539498
H  1.122658 1.336923 -2.097896
H  2.553745 0.42972 -1.585707
H  1.055226 2.509132 0.162027
H  2.604717 2.774316 -0.668217
H  2.876777 2.189912 1.814023
H  3.72535 1.057656 0.730447
H  0.979281 0.585127 2.075058
H  2.512408 -0.278883 2.445365
H  1.216472 -2.148901 -1.399625
H  -0.696229 1.964736 -1.428799
H  -0.16653 -2.139674 -3.369967
H  0.710567 -0.592317 -3.575008
H  -0.932892 -0.619452 -2.855759
H  -3.332944 -0.741588 1.837252
H  -3.001146 2.659984 -0.852238
H  -4.352944 1.315558 0.804484
