program: Gaussian 09
title: 000182135
version: EM64L-G09RevD.01
frameworkgroup: C1[X(C12Br2F8)]
method: RPBEPBE
basis: SDD
operation: Freq
keyword: #pfreq=noraman
keyword: PBEPBE/SDD
title: #p freq=noraman PBEPBE/SDD
converged: NO NO NO NO
title: Mulliken charges:
elementType: Br Br F F F F F F F F C C C C C C C C C C C C
charge: 0.120626 0.153905 -0.141266 -0.137804 -0.137804 -0.139106 -0.139279 -0.139278 -0.140427 -0.136927 0.320579 -0.052688 -0.320873 0.161799 0.202430 0.202442 -0.428207 0.060728 0.077513 0.077496 0.410231 0.125911
chargesum: 0.00000
title: Mulliken charges with hydrogens summed into heavy atoms:
polarizability: 2.25465688e+02 4.36466757e+00 1.58150187e+02 -8.12319499e-03 2.16900620e-03 1.11281383e+02
1716.lowfreq: -8.1556 -0.0008 -0.0007 -0.0007 2.2354 3.2835 4.4144 30.6923 36.7689
frequency: -6.7880 30.6278 36.7678 64.8108 95.3538 107.7128 121.7796 128.8598 145.9863 146.3185 161.9481 194.2397 202.7947 224.9900 255.3436 256.2799 260.1881 265.3762 284.6276 289.1658 323.1657 337.7058 342.8813 371.1722 384.9355 397.6162 426.1227 463.9283 492.2056 543.3242 593.0954 608.5664 620.7598 634.3604 637.6699 689.7911 725.1375 741.7367 779.8048 782.9450 816.8211 923.6196 941.4077 1000.8811 1071.5542 1074.9053 1176.1935 1225.2730 1277.7667 1342.8984 1359.0805 1372.3777 1426.2799 1434.3898 1449.4604 1483.1738 1571.6339 1596.7246 1600.5864 1628.7200
redmass: 19.1896 30.4678 21.5648 22.3457 18.5054 20.9601 18.5656 58.7957 18.7936 18.6570 19.1969 30.7602 13.4628 14.5306 18.8134 19.1625 20.6919 20.7814 18.0309 18.2235 17.6057 17.1924 12.5903 12.6425 12.8165 12.9722 15.7122 16.0896 16.6712 17.2865 12.8231 12.1313 12.3053 12.1799 13.3711 12.4290 12.3356 13.4269 12.5288 12.1914 13.1322 14.2114 13.3531 13.6621 13.1839 13.6075 12.7507 12.5446 12.3298 12.0176 12.0015 12.3510 12.3546 12.4026 12.2631 12.1318 12.0251 12.0194 12.0232 12.0142
irintensity: 0.0310 0.0127 0.0937 0.0543 0.0006 0.1122 0.0001 0.1135 0.1061 0.0448 0.0155 0.7208 0.1924 2.7609 0.0288 0.0244 0.2242 0.1976 1.2348 2.1052 2.4206 0.8563 3.5700 0.0798 0.1033 0.0376 0.0527 1.9515 0.5673 1.5007 6.0355 0.0002 1.3331 0.0056 54.5801 13.5807 0.6290 51.9119 43.8952 0.1493 0.6708 151.4587 39.3378 120.1853 18.0913 1.1197 29.8849 1.4367 14.5869 1.8768 0.0103 46.5112 324.9396 196.0900 260.0055 30.9362 0.8957 16.4487 0.0201 12.1515
temp: 298.150 k
press: 1.00000 atm
elementType: 35 35 9 9 9 9 9 9 9 9 6 6 6 6 6 6 6 6 6 6 6 6
symmnumber: 1
zpe: 238917.2 jmol-1
zpe.correction: 0.090999 hartree
zpe.thermalcorrener: 0.110230 hartree
zpe.thermalcorrenthalpy: 0.111174 hartree
zpe.thermalcorrgfe: 0.041709 hartree
zpe.sumelectzpe: -1281.312692 hartree
zpe.sumelectthermal: -1281.293461 hartree
zpe.sumelectthermalent: -1281.292517 hartree
zpe.sumelectthermalfe: -1281.361982 hartree
dipole: 0.7551 -1.6012 -0.0006
dipole: 1.7703
quadrupole: -149.1535 -140.1473 -146.1263
quadrupole: -5.3511 -0.0020 0.0061
quadrupole: -4.0111 4.9950 -0.9839 -5.3511 -0.0020 0.0061
hfenergy: -1281.403691 hartree
pointgroup: C01 [X(C12Br2F8)]
dipole: -0.1596466 0.6779337 -0.0002326 debye
dipolederiv: -0.0991866 -0.2409755 0.0000867 -0.2124428 -0.3496677 0.0001498 0.0000778 0.0001463 0.0574371 -0.1799752 0.2648921 -0.0001015 0.3295559 -0.2352367 0.0001214 -0.0001242 0.0001224 0.0794466 -0.4339375 0.3896819 -0.0001593 0.3116942 -0.8331514 0.000281 -0.0001037 0.0002612 -0.0892498 -0.3684231 0.0066649 -0.3083372 0.0011605 -0.0860689 0.0002683 -0.2639916 -0.0151302 -0.7313447 -0.368476 0.0070216 0.308353 0.0015122 -0.0860512 -0.00106 0.2640325 0.0143641 -0.7313044 -0.3954176 -0.3692323 0.0001103 -0.4059792 -0.9108297 0.0002643 0.0001214 0.0002534 -0.0777067 -0.4451729 0.0254036 -0.3469251 0.0037214 -0.0766963 0.0025554 -0.4545028 0.032235 -0.7321786 -0.4452374 0.0258375 0.3469304 0.0042968 -0.0767404 -0.0033859 0.4545228 -0.0330457 -0.7320849 -1.0257877 -0.1943648 0.0000315 -0.1078887 -0.1788426 0.0000254 -0.0000205 0.0000121 -0.0957278 -1.0885141 0.0497936 -0.0000594 0.0065526 -0.0775785 -0.0000487 -0.0000419 -0.0000439 -0.1527414 0.1873461 -0.1325234 0.000066 -0.0426193 -0.2761094 0.0000637 0.0000342 0.000088 -0.0340188 0.1161214 -0.0294802 0.000017 -0.0157558 -0.0298481 -0.0000564 0.0000131 -0.0001003 -0.1510898 0.1081665 0.4646418 -0.0001752 0.5367915 0.6169162 -0.0002591 -0.0002089 -0.0002435 -0.0580536 0.4300633 -0.4468455 0.000175 -0.2417437 0.8937128 -0.0002962 0.0000876 -0.0002792 0.1065633 0.3660888 0.001863 0.4447186 0.0110671 0.090241 -0.0095762 0.1736439 0.0357385 0.8163015 0.3661266 0.0013527 -0.4447455 0.0108365 0.0902016 0.0104571 -0.1737035 -0.0348783 0.8162574 0.1560903 -0.5826079 0.0002103 -0.8688427 0.2807205 -0.0001575 0.0003308 -0.0001571 -0.1283553 0.2432032 0.4490549 -0.0001417 0.5055845 0.9407225 -0.000268 -0.0001797 -0.0002621 0.0630193 0.2913536 -0.0187124 0.5415174 -0.0070024 0.0623145 -0.0084291 0.5672116 -0.0326636 0.7416056 0.2914281 -0.0193776 -0.54154 -0.0076971 0.0623664 0.0092972 -0.5672501 0.0335214 0.7414801 1.0539927 0.3885494 -0.0000925 0.1974927 0.0948772 0.000024 -0.0000076 0.0000408 0.1523643 1.2401475 -0.0406375 0.0000609 -0.0102941 0.0847483 0.0000295 0.0000588 0.0000207 0.1393804 unknown
polarizability: 224.3320686|-9.6992474|159.2838062|0.0074949|-0.0038101|111.2813833 unknown
InChI: InChI=1S/C12Br2F8/c13-3-1(5(15)9(19)8(18)4(3)14)2-6(16)10(20)12(22)11(21)7(2)17
charge 0 multiplicity 1
22 atoms
Br -0.61492 2.898841 -0.001075
Br -4.086719 2.686592 -0.001067
F  -0.667137 -2.41171 0.000771
F  0.796773 0.005931 -2.417676
F  0.796578 0.008963 2.417748
F  -3.444399 -2.560264 0.0007
F  3.579702 -0.005157 2.420649
F  3.579898 -0.008222 -2.420335
F  -4.953438 -0.245959 -0.000123
F  4.974333 -0.013515 0.000218
C  -0.747265 0.006338 -0.000028
C  0.745527 0.018292 0.000027
C  -1.531122 1.191298 -0.000464
C  -1.412274 -1.23664 0.000359
C  1.478107 0.00538 -1.205414
C  1.47801 0.006898 1.205542
C  -2.948353 1.127522 -0.000485
C  -2.813508 -1.325961 0.000328
C  2.885571 -0.000499 1.22022
C  2.88567 -0.002043 -1.219969
C  -3.5710 -0.140892 -0.000083
C  3.589867 -0.005291 0.000156
