program: Gaussian 09
title: 000017676
version: EM64L-G09RevD.01
frameworkgroup: C1[X(C23H29N3O2S)]
method: RPBEPBE
basis: SDD
operation: Freq
keyword: #p
keyword: freq=noraman
keyword: PBEPBE/SDD
title: #p freq=noraman PBEPBE/SDD
converged: YES YES NO NO
title: Mulliken charges:
elementType: S O O N N N C C C C C C C C C C C C C C C C C C C C C C C H H H H H H H H H H H H H H H H H H H H H H H H H H H H H
charge: 0.232214 -0.456928 -0.226822 -0.106184 -0.087668 -0.299100 -0.358236 -0.367191 -0.375776 -0.368129 -0.333219 -0.430762 -0.316081 -0.405482 -0.335314 0.560310 0.476086 -0.400581 -0.344286 -0.481216 -0.323322 -0.274984 0.375804 -0.268743 -0.412169 -0.242763 -0.254098 0.092704 -0.793243 0.192989 0.196647 0.217487 0.191089 0.209677 0.174769 0.187081 0.199597 0.190160 0.224818 0.206325 0.240363 0.201564 0.219189 0.246244 0.209092 0.205982 0.193074 0.246449 0.244439 0.250340 0.248381 0.346273 0.283379 0.228870 0.233674 0.237243 0.236752 0.263229
chargesum: 0.00000
title: Mulliken charges with hydrogens summed into heavy atoms:
elementType: S O O N N N C C C C C C C C C C C C C C C C C C C C C C C
charge: 0.232214 -0.110655 -0.226822 -0.106184 -0.087668 -0.299100 0.031400 0.041386 0.008671 0.018549 0.081760 0.015926 0.104672 0.049853 0.063742 0.560310 0.476086 -0.400581 -0.344286 -0.234767 -0.078884 -0.024644 0.375804 -0.020362 -0.128790 -0.013893 -0.020424 0.092704 -0.056019
chargesum: 0.00029
polarizability: 3.73091433e+02 -8.35398190e+01 2.83698326e+02 -2.50744082e+01 -2.53725537e+01 2.51635054e+02
1716.lowfreq: -12.3541 -5.8488 -1.9929 -0.5986 -0.0127 2.7116 4.7038 10.8160 22.8490
frequency: -2.4906 10.0421 22.7994 29.9988 39.0318 45.1134 49.5300 54.6485 68.9271 86.5196 100.3302 115.1318 130.7033 140.3429 159.8916 181.5063 196.9656 224.6294 247.4216 253.4173 256.0361 260.5726 275.1211 285.1968 296.3545 316.6074 328.5919 342.1233 353.1029 374.5571 388.3492 398.2392 409.5556 427.5723 434.0537 446.8405 457.7601 480.6152 485.8265 492.7996 513.7249 529.7239 548.2659 585.0133 607.7758 612.8922 619.2835 644.5033 663.1452 696.2888 718.3573 728.1147 735.9168 753.7391 768.5381 779.8763 818.7720 832.7942 842.9292 846.9894 847.8219 866.5455 876.3054 916.2569 929.9000 930.6435 947.0391 972.3386 974.9966 975.7828 980.7355 995.6496 998.4618 1021.2047 1025.5112 1029.7620 1036.9980 1040.1097 1052.4978 1056.0318 1071.5787 1085.5330 1089.8076 1096.8624 1104.8794 1125.9783 1135.8667 1139.4116 1142.4766 1146.6868 1156.5658 1174.2880 1191.7530 1195.1618 1210.8851 1212.7932 1235.2777 1249.7066 1252.4222 1268.4210 1272.1156 1278.4006 1281.2660 1288.6518 1299.3929 1305.4125 1322.2736 1329.7227 1333.5255 1345.3263 1351.7086 1363.1489 1366.7178 1367.2293 1374.9523 1380.2923 1387.7067 1388.1869 1405.8421 1416.7312 1430.3378 1447.6575 1453.3541 1453.7859 1457.0148 1460.8025 1463.4191 1464.0798 1465.4419 1473.7479 1476.7687 1480.2217 1484.0996 1486.3830 1555.0953 1572.6718 1583.6867 1600.3375 1608.1368 2836.5606 2847.0013 2866.3025 2872.8291 2887.4732 2892.9900 2950.2142 2969.8579 2979.7263 2993.4460 3006.8561 3029.3075 3030.2377 3034.8818 3037.6905 3045.8220 3048.8420 3052.6931 3063.7343 3086.5201 3123.7494 3133.5414 3143.0175 3143.5030 3160.2661 3168.7207 3171.4742 3172.4507 3577.1696
redmass: 5.4118 5.8733 3.2149 4.4101 4.1332 3.1465 4.4900 4.0478 4.6133 6.6674 3.3290 4.2281 4.6502 3.9876 1.0537 3.3782 4.2955 2.8552 4.2284 2.0194 1.2064 3.3683 4.3192 6.1862 3.5834 2.6261 2.5968 3.1423 5.6980 2.6791 3.2439 4.0339 2.2350 3.6602 3.2877 3.8248 3.6720 3.9238 3.2445 4.2196 3.6834 3.5724 4.0279 4.4211 2.4152 4.7736 4.3308 3.2477 6.1045 5.3937 3.4017 3.3147 2.6249 1.4042 4.1019 3.4502 1.1642 1.9060 1.3292 1.5160 1.3993 2.5739 1.6369 3.2347 1.3995 2.3761 2.0026 1.3302 1.3513 5.5534 2.2113 2.5435 2.5281 5.8128 1.8625 2.5064 3.4471 2.1702 1.8368 1.8877 2.0065 2.2482 2.4164 2.6556 2.1802 1.5827 2.1972 2.2610 1.4916 2.8006 1.7303 1.0655 1.0764 1.2167 1.3628 1.2767 2.1485 1.5127 1.7688 1.4395 1.3636 1.8382 2.1038 1.2872 1.3529 1.2763 1.9945 1.3278 1.3729 1.3891 1.3832 1.4646 1.4179 1.4027 4.4803 1.4455 1.8185 3.8601 3.1112 1.4840 2.3032 1.1159 1.0826 1.0805 1.0956 1.1354 1.0780 1.4669 1.4551 1.0829 1.1048 1.8552 1.3946 1.0831 7.1542 6.1986 6.8322 7.6140 6.9928 1.0711 1.0700 1.0703 1.0698 1.0699 1.0694 1.0563 1.0678 1.0378 1.0643 1.1024 1.0895 1.0899 1.0872 1.0907 1.0880 1.0931 1.0984 1.0970 1.0924 1.0987 1.0852 1.0904 1.0889 1.0933 1.0919 1.0938 1.0999 1.0666
irintensity: 0.1898 0.1348 3.0319 0.7799 0.2001 9.6757 1.9444 2.2655 0.5710 3.7376 0.1015 1.6668 0.4035 0.9286 0.3816 5.9639 2.7546 1.9292 3.1071 28.3108 119.6424 5.4985 2.7033 0.6494 6.3127 8.1561 6.6915 4.3789 1.4491 12.9467 7.5828 4.1352 0.1281 9.3051 2.2033 0.9750 12.8985 6.0644 3.0682 4.8040 0.0597 1.5035 0.2145 9.2007 1.7032 6.0731 4.1237 12.0942 3.9547 4.6869 1.5611 0.8396 38.6533 79.8908 5.8896 22.9411 0.4818 3.8662 33.2171 0.7997 0.5230 6.3751 28.7389 9.9688 2.3771 10.2924 28.2290 0.8228 3.2971 110.2130 44.7705 3.0846 24.4628 39.0992 3.2479 14.2366 6.3154 0.8788 0.6149 0.4648 6.3877 5.2176 1.8487 18.5124 3.1772 14.7899 24.0516 22.1300 19.5192 46.8746 9.2704 0.7611 5.4980 15.2769 36.5034 47.1618 123.0013 60.8219 14.1929 17.7923 20.1096 36.8995 42.2275 5.2837 45.4697 2.0952 204.1604 6.0519 13.4883 8.0185 1.4663 6.4920 31.8435 32.9459 16.0615 2.5429 1.6781 3.3718 68.9974 0.2664 20.6428 67.5554 1.1320 0.0796 4.7248 42.5836 12.6190 128.8239 63.3823 8.8695 1.8144 19.6971 28.7346 5.7013 207.9960 17.4290 15.1946 68.4273 43.8085 59.5722 74.1028 47.2588 62.7915 174.6194 138.4486 59.4132 37.1483 3.6890 47.1842 43.7476 9.3183 19.1610 64.7726 44.5840 21.0692 67.4329 44.6597 11.6819 6.4482 18.0455 2.0092 8.4451 3.8278 21.6233 7.9184 0.4562 22.7440 3.7996
temp: 298.150 k
press: 1.00000 atm
elementType: 16 8 8 7 7 7 6 6 6 6 6 6 6 6 6 6 6 6 6 6 6 6 6 6 6 6 6 6 6 1 1 1 1 1 1 1 1 1 1 1 1 1 1 1 1 1 1 1 1 1 1 1 1 1 1 1 1 1
symmnumber: 1
zpe: 1255342.9 jmol-1
zpe.correction: 0.478135 hartree
zpe.thermalcorrener: 0.505454 hartree
zpe.thermalcorrenthalpy: 0.506398 hartree
zpe.thermalcorrgfe: 0.418015 hartree
zpe.sumelectzpe: -1604.412251 hartree
zpe.sumelectthermal: -1604.384932 hartree
zpe.sumelectthermalent: -1604.383988 hartree
zpe.sumelectthermalfe: -1604.472370 hartree
dipole: 1.3477 -4.9536 0.5655
dipole: 5.1647
quadrupole: -176.6888 -198.9095 -165.8102
quadrupole: 3.6989 11.6961 -8.0218
quadrupole: 3.7807 -18.4400 14.6593 3.6989 11.6961 -8.0218
hfenergy: -1604.8903854 hartree
pointgroup: C01 [X(C23H29N3O2S1)]
dipole: -0.6061644 -1.9060267 -0.358365 debye
polarizability: 378.3604891|82.1597784|273.665305|-20.0289778|26.5739673|256.3990186 unknown
InChI: InChI=1S/C23H29N3O2S/c1-18(28)19-7-8-23-21(17-19)26(20-5-2-3-6-22(20)29-23)10-4-9-24-11-13-25(14-12-24)15-16-27/h2-3,5-8,17,27H,4,9-16H2,1H3
charge 0 multiplicity 1
58 atoms
S  -2.903296 0.45974 2.307127
O  7.533926 -0.498931 0.73803
O  1.784831 4.676233 -0.39152
N  1.173103 -2.054813 -0.085473
N  4.041854 -1.677808 0.105711
N  -1.943189 -0.229932 -0.535013
C  2.113073 -2.92449 -0.832338
C  1.799673 -1.568743 1.168304
C  3.413502 -2.164793 -1.145298
C  3.096368 -0.807663 0.848334
C  -0.169557 -2.655612 0.107244
C  -1.061344 -2.50558 -1.148608
C  5.36386 -1.047029 -0.121897
C  -1.205871 -1.020223 -1.552466
C  6.249824 -1.106075 1.130007
C  -1.359608 0.958479 0.001579
C  -3.320539 -0.527524 -0.300869
C  -1.741243 1.438685 1.288047
C  -3.937575 -0.200312 0.938581
C  -0.387135 1.702622 -0.714843
C  -4.126757 -1.150545 -1.293264
C  -1.176157 2.613838 1.828881
C  0.224496 2.855394 -0.158346
C  -5.304704 -0.44448 1.169354
C  -0.182415 3.314022 1.12214
C  -5.488439 -1.432572 -1.050643
C  -6.089179 -1.075789 0.176449
C  1.294435 3.617491 -0.886482
C  1.795836 3.08993 -2.228783
H  2.365445 -3.844658 -0.247121
H  1.641562 -3.24327 -1.780347
H  1.091539 -0.888207 1.675913
H  2.039235 -2.409642 1.86608
H  4.121374 -2.842807 -1.657279
H  3.174509 -1.32117 -1.844426
H  2.835933 0.107776 0.25558
H  3.565991 -0.477023 1.791946
H  -0.107301 -3.73469 0.390805
H  -0.661404 -2.12958 0.946649
H  -0.619217 -3.050746 -2.006214
H  -2.046902 -2.966457 -0.950216
H  5.280089 0.015724 -0.45623
H  5.884957 -1.599733 -0.925039
H  -0.178255 -0.62845 -1.603719
H  -1.665023 -0.920224 -2.556527
H  6.375207 -2.164126 1.438129
H  5.789719 -0.5431 1.969543
H  -0.105913 1.380867 -1.720323
H  -3.692253 -1.412594 -2.261825
H  -1.507129 2.961186 2.813213
H  -5.747307 -0.158881 2.129575
H  8.145388 -0.48849 1.515929
H  0.289966 4.211659 1.532011
H  -6.080944 -1.922457 -1.831035
H  -7.147152 -1.284844 0.363447
H  0.980467 3.062566 -2.975981
H  2.190625 2.060936 -2.128576
H  2.595219 3.750712 -2.596607
