program: Gaussian 09
title: 000195993
version: EM64L-G09RevD.01
frameworkgroup: C1[X(C9H9NO3)]
method: RPBEPBE
basis: SDD
operation: Freq
keyword: #pfreq=noraman
keyword: PBEPBE/SDD
title: #p freq=noraman PBEPBE/SDD
converged: YES YES NO NO
title: Mulliken charges:
elementType: O O O N C C C C C C C C C H H H H H H H H H
charge: -0.420642 -0.398182 -0.388010 -0.091500 0.207216 -0.213305 0.313551 -0.234361 -0.515116 -0.449609 -0.618232 0.139858 0.080118 0.271119 0.285399 0.274659 0.255028 0.269628 0.269226 0.239923 0.353396 0.369834
chargesum: 0.00000
title: Mulliken charges with hydrogens summed into heavy atoms:
elementType: O O O N C C C C C C C C C
charge: -0.067246 -0.028348 -0.388010 -0.091500 0.207216 0.057814 0.313551 0.051038 -0.240457 -0.194580 0.160544 0.139858 0.080118
polarizability: 2.29181225e+02 -1.27808544e+01 1.29774441e+02 4.72073278e+00 3.20602553e+00 5.92129312e+01
1716.lowfreq: -3.0582 -0.0009 -0.0007 0.0003 7.5186 8.4902 84.4887 105.2409 123.3586
frequency: 84.4847 105.2322 123.3552 139.0932 193.3365 226.3282 253.3636 294.5538 314.7776 342.8965 391.0606 416.2230 423.0427 460.4747 489.6736 550.8741 602.1153 630.2311 665.1593 678.8914 708.3914 713.3510 756.4565 787.7112 821.8323 863.3532 904.6620 937.0903 994.7171 1030.4280 1073.3037 1114.6284 1123.7985 1140.6819 1173.8472 1200.4116 1206.2010 1220.1822 1260.1084 1316.5109 1336.5055 1343.1400 1387.0027 1410.5779 1458.1867 1464.6820 1473.6528 1508.3183 1558.6831 1579.8785 1587.9684 2802.1980 3003.1883 3011.7106 3105.8552 3136.8868 3164.0782 3166.0625 3235.8111 3545.2906
redmass: 6.4695 4.1031 2.2667 1.4368 4.9982 3.9458 4.1557 4.4482 1.2634 5.1153 6.5974 4.3368 3.7503 5.8105 3.2653 3.5483 2.7726 2.1510 7.0194 4.0398 6.8146 2.9547 4.1531 1.7734 3.3565 1.3998 1.0803 5.4250 2.1897 2.9707 2.3012 2.2027 1.4505 1.5909 2.3004 1.3448 1.9315 1.4743 2.5518 3.1707 1.4250 2.5423 2.3423 1.6067 1.0436 3.0332 1.2492 3.1757 5.9449 5.1291 6.2348 1.0607 1.0807 1.0336 1.1018 1.1031 1.0929 1.0922 1.0970 1.0666
irintensity: 3.4979 0.4712 2.1907 0.2552 1.0854 3.6316 3.9188 33.7317 19.5070 7.0873 11.5068 4.8909 4.0117 13.1570 3.9904 4.6670 14.1272 13.1303 3.5777 13.6519 6.5449 1.6135 57.9378 25.3304 30.4498 16.1037 131.4518 39.8336 33.3090 44.6794 107.3549 1.1016 1.0878 51.6878 46.3352 34.4453 46.5834 24.2188 94.6530 80.5942 148.4328 490.2151 9.3498 68.8027 22.0774 11.9159 58.2840 256.1573 159.9757 8.9547 118.3074 223.5620 4.8765 18.6989 4.9130 4.7987 5.8439 1.8844 46.9738 15.3788
temp: 298.150 k
press: 1.00000 atm
elementType: 8 8 8 7 6 6 6 6 6 6 6 6 6 1 1 1 1 1 1 1 1 1
symmnumber: 1
zpe: 430730.5 jmol-1
zpe.correction: 0.164057 hartree
zpe.thermalcorrener: 0.175579 hartree
zpe.thermalcorrenthalpy: 0.176523 hartree
zpe.thermalcorrgfe: 0.127007 hartree
zpe.sumelectzpe: -627.775970 hartree
zpe.sumelectthermal: -627.764448 hartree
zpe.sumelectthermalent: -627.763503 hartree
zpe.sumelectthermalfe: -627.813020 hartree
dipole: -9.2511 2.1935 0.1594
dipole: 9.5089
quadrupole: -83.8721 -75.0905 -73.6117
quadrupole: -15.3338 -0.5917 -0.6365
quadrupole: -6.3473 2.4342 3.9131 -15.3338 -0.5917 -0.6365
hfenergy: -627.9400266 hartree
pointgroup: C01 [X(C9H9N1O3)]
dipole: -3.6308639 -0.9012296 -0.018073 debye
dipolederiv: -0.297702 0.1065377 -0.145101 0.231507 -0.5349227 0.1755449 -0.2283039 0.2595915 -0.3185099 -1.6940934 -0.4228225 0.0265381 -0.4515261 -0.4938428 0.0158595 0.0508041 0.0212334 -0.3633026 -1.3686331 0.3370279 0.0983376 0.5538643 -0.5542074 -0.0516537 0.1422324 -0.0465474 -0.4219633 1.4241552 0.4872656 -0.0113533 -0.742419 -0.4737198 0.0015587 -0.1768714 -0.078547 -0.0184167 0.3534985 0.4776327 -0.019527 0.7243516 -0.0881234 0.0080632 0.0564485 0.068925 -0.1375253 -0.0835259 -0.3023579 0.0387857 -0.3064886 0.307975 -0.1735027 0.1453664 -0.2859477 0.4448231 -0.1356713 -0.4024107 -0.0607281 -1.0974794 -0.0700237 0.0700065 -0.1221503 0.0363381 0.0204974 -1.2850634 -0.446386 0.019656 0.984778 0.4768787 0.080932 0.1403365 0.1460736 -0.236681 -0.8113663 -0.3116607 0.0033338 0.2969162 0.1369287 0.0284491 0.0772205 0.0507299 -0.1557621 -0.3837353 0.3697609 0.0488746 -0.037938 0.0469909 0.0468293 0.0023185 0.0064068 -0.2703037 0.2447168 0.1192204 0.0054927 0.2868415 0.3090247 -0.0025227 0.0606671 0.0014568 0.1683795 1.6650662 0.5123924 -0.0349299 0.5741715 0.0979129 -0.0447297 -0.0574928 -0.0504846 0.0801703 1.1139221 -0.5464409 -0.1284373 -1.0296423 0.0347939 0.0660938 -0.1923884 0.0481928 0.082082 0.1516924 0.0605577 0.0374648 0.0519042 0.0349506 -0.0457111 -0.0253653 0.0155544 -0.0154068 0.1250573 -0.0156314 0.0002551 -0.018079 0.1015559 -0.0160559 0.0096143 -0.0161731 0.1989436 0.0740003 0.0074265 0.0076525 -0.0045684 -0.0381731 -0.0294061 0.0048794 -0.0269202 0.1621631 0.0725501 -0.0325536 0.0045662 0.0134032 -0.0534384 -0.0307026 -0.0068441 -0.0382986 0.1849359 0.0802297 0.044048 -0.0834321 -0.0508794 0.0174771 0.0227005 -0.0326084 0.0630069 0.0174562 0.0909855 0.0156229 0.0836657 -0.0485093 0.0332242 -0.0046805 0.0105565 -0.0597838 -0.0126675 -0.0848562 -0.0562737 0.00187 0.0583849 0.0779041 -0.0101365 0.0178857 -0.0040835 0.1257333 0.2098003 -0.0208205 0.1154856 -0.0040892 0.2561772 -0.1069072 0.1382976 -0.1152094 0.1316326 0.5389725 0.0198653 -0.0084697 0.0154964 0.3746573 -0.0000286 -0.0146031 0.0044862 0.3337219 unknown
polarizability: 228.6262846|14.1719941|129.7674398|-7.8204206|5.3304932|59.7748727 unknown
InChI: InChI=1S/C9H9NO3/c1-10-4-9(13)5-2-7(11)8(12)3-6(5)10/h2-4,9,11,13H,1H3
charge 0 multiplicity 1
22 atoms
O  -2.394601 2.383079 -0.392694
O  3.153639 1.302013 0.05182
O  3.124283 -1.220024 -0.259428
N  -1.856179 -1.024707 0.097081
C  -0.491758 0.81845 0.27004
C  -1.92906 1.281721 0.461834
C  -0.488478 -0.597514 0.084535
C  -2.719589 -0.009905 0.28175
C  0.722751 1.526112 0.273443
C  0.663519 -1.390378 -0.098959
C  -2.225876 -2.439572 -0.088452
C  1.894879 0.763389 0.085824
C  1.922085 -0.711449 -0.102763
H  -2.098466 1.661786 1.488874
H  -3.800919 -0.133394 0.293137
H  0.773586 2.610328 0.407646
H  0.637136 -2.475059 -0.234747
H  -1.768069 -3.045737 0.710877
H  -1.843615 -2.792404 -1.060772
H  -3.319803 -2.548835 -0.056645
H  -2.056727 2.227803 -1.312732
H  3.730362 0.447295 -0.10107
