program: Gaussian 09
title: 000182119
version: EM64L-G09RevD.01
frameworkgroup: C1[X(C11H15Cl2O4PS)]
method: RPBEPBE
basis: SDD
operation: Freq
keyword: #p
keyword: freq=noraman
keyword: PBEPBE/SDD
title: #p freq=noraman PBEPBE/SDD
converged: YES YES NO NO
title: Mulliken charges:
elementType: Cl Cl S P O O O O C C C C C C C C C C C H H H H H H H H H H H H H H H
charge: 0.033083 0.036484 0.207080 1.412248 -0.503034 -0.510002 -0.496440 -0.587114 -0.366887 -0.365427 -0.484836 -0.279467 -0.005896 -0.327546 -0.126724 -0.515795 -0.479974 0.136848 -0.375739 0.210906 0.218175 0.222152 0.221055 0.224353 0.224808 0.240818 0.238715 0.253121 0.243005 0.262491 0.249161 0.249498 0.247010 0.293872
chargesum: 0.00000
title: Mulliken charges with hydrogens summed into heavy atoms:
elementType: Cl Cl S P O O O O C C C C C C C C C C C
charge: 0.033083 0.036484 0.207080 1.412248 -0.503034 -0.510002 -0.496440 -0.587114 0.062194 0.077780 -0.035676 0.200066 -0.005896 -0.074425 0.116280 -0.253304 0.265695 0.430720 -0.375739
polarizability: 2.35268873e+02 4.77880099e+00 2.01136576e+02 -2.81063658e+01 1.13808877e+01 1.41591199e+02
1716.lowfreq: -11.0525 -6.4454 -4.8455 -2.8408 0.0011 0.0012 0.0025 8.5558 18.3306
frequency: -6.9163 8.4064 18.1578 23.5972 29.7963 34.5983 49.4292 61.5198 72.7672 88.7880 89.1030 94.6303 121.0346 127.9917 156.2046 167.4943 204.0839 220.6507 238.8358 265.8892 277.2097 296.9779 310.9491 345.8035 377.4777 381.4137 421.6378 432.6840 455.8126 491.6621 560.2357 574.7432 600.9752 620.1778 640.1403 672.6608 695.6665 705.1702 741.1745 744.9574 791.1767 820.5589 831.4063 834.8332 877.7172 901.7895 909.1260 915.6090 965.0028 1014.4257 1023.6523 1045.6495 1068.0828 1070.3553 1076.3812 1088.7348 1092.8847 1113.1346 1130.1522 1146.8528 1173.2000 1218.2954 1241.7147 1249.9916 1280.8791 1281.9504 1288.1312 1305.9961 1337.8219 1351.4823 1370.4755 1424.4681 1456.0612 1459.4671 1466.8040 1469.8399 1475.5044 1483.3103 1487.1435 1561.1322 1659.0155 2968.9017 2980.9308 2995.4298 2995.9575 3004.8905 3018.7849 3040.3741 3059.1477 3087.2202 3102.8152 3140.4137 3141.7859 3162.5333 3182.5779 3237.9897
redmass: 6.6009 6.0838 8.9403 7.3370 4.0266 4.8372 4.1104 2.9082 1.2782 3.7325 3.7001 2.8506 2.8061 4.7445 16.8258 5.4202 6.3777 7.2125 8.2573 8.8162 3.4752 8.2266 5.5206 4.6989 11.6745 5.9799 5.2547 6.5563 7.3673 4.7411 3.3302 10.2062 6.6930 4.5505 8.4959 13.0012 1.1852 6.1140 1.1405 7.8880 1.2008 3.6166 1.3610 1.3318 10.8482 1.3414 1.4317 7.2717 11.6524 3.9842 2.3493 2.6504 10.7714 1.4177 9.4866 1.1490 3.1977 1.2512 1.2945 1.4482 2.2496 1.3383 1.2696 1.2851 1.1197 1.1148 1.1552 1.3353 1.6897 1.6758 1.3771 1.1227 1.0827 1.0504 1.0778 1.0531 1.0943 6.8297 1.0927 6.3139 8.5298 1.0605 1.0599 1.0293 1.0590 1.0568 1.0978 1.1022 1.1049 1.1091 1.1064 1.1038 1.0933 1.0908 1.0966 1.1004
irintensity: 0.0462 0.1200 0.2254 0.1693 0.5018 0.9227 6.9082 1.5349 0.3727 0.8875 1.9472 0.8020 2.9655 3.4105 1.0802 2.4482 1.4426 3.7515 0.9545 4.0986 7.4976 10.9640 2.9495 18.4461 39.4031 19.0549 21.1022 50.6993 9.4497 7.6856 0.4078 3.5036 3.0239 2.4609 42.1303 221.5183 104.1429 4.9353 15.7796 120.6137 1.7287 10.1131 14.5642 27.9231 178.9670 1.5127 23.5964 295.6053 242.4648 28.5015 8.6467 2.9744 145.0030 11.3732 391.7061 0.7648 11.2331 1.9760 1.1176 3.9184 5.8883 18.6425 7.4417 3.4110 8.6620 11.0208 1.8283 6.4822 0.1806 1.0353 13.9978 1.1572 2.1992 13.3856 0.3066 16.1578 2.4002 10.1557 20.6100 4.6788 20.7741 12.2403 22.3044 41.7553 7.9220 40.3863 2.6939 8.4489 19.6651 46.4515 21.2736 9.4340 34.1947 7.5844 6.0118 1.0563
temp: 298.150 k
press: 1.00000 atm
elementType: 17 17 16 15 8 8 8 8 6 6 6 6 6 6 6 6 6 6 6 1 1 1 1 1 1 1 1 1 1 1 1 1 1 1
symmnumber: 1
zpe: 641799.3 jmol-1
zpe.correction: 0.244448 hartree
zpe.thermalcorrener: 0.266862 hartree
zpe.thermalcorrenthalpy: 0.267806 hartree
zpe.thermalcorrgfe: 0.185784 hartree
zpe.sumelectzpe: -2386.927633 hartree
zpe.sumelectthermal: -2386.905219 hartree
zpe.sumelectthermalent: -2386.904275 hartree
zpe.sumelectthermalfe: -2386.986298 hartree
dipole: -1.9553 -1.6918 2.6045
dipole: 3.6700
quadrupole: -133.6615 -144.0580 -141.3063
quadrupole: 0.9358 9.4006 -8.8699
quadrupole: 6.0138 -4.3827 -1.6310 0.9358 9.4006 -8.8699
hfenergy: -2387.1720816 hartree
pointgroup: C01 [X(C11H15Cl2O4P1S1)]
dipole: -0.6516291 0.7280259 -1.0631134 debye
polarizability: 230.7041529|-8.0704105|202.2095462|33.9441336|8.4631804|145.0829494 unknown
InChI: InChI=1S/C11H15Cl2O4PS/c1-15-18(14,17-9-11(12)13)16-7-3-2-5-10-6-4-8-19-10/h4,6,8-9H,2-3,5,7H2,1H3
charge 0 multiplicity 1
34 atoms
Cl 4.895237 -3.797243 1.16654
Cl 2.861546 -3.225065 -1.036578
S  -4.796156 -1.502167 -0.57927
P  3.11577 1.323829 0.435677
O  1.501945 1.391839 0.959501
O  3.033723 2.18095 -1.045454
O  3.327297 -0.314733 -0.224495
O  4.206834 1.698255 1.517495
C  -2.119296 0.567822 0.069211
C  -0.873315 0.953504 0.901757
C  -3.39894 0.511821 0.948803
C  0.380408 1.004467 0.031945
C  -4.645829 0.136828 0.191227
C  -5.791271 0.88248 -0.046114
C  -6.798388 0.197989 -0.825571
C  -6.431354 -1.084245 -1.194293
C  4.260766 2.293921 -1.876301
C  4.035605 -1.261764 0.532512
C  3.928417 -2.580937 0.254296
H  -1.96226 -0.41959 -0.408694
H  -2.276565 1.295671 -0.750551
H  -1.022789 1.942078 1.375716
H  -0.718746 0.220519 1.715992
H  -3.223761 -0.197079 1.783513
H  -3.565622 1.504322 1.410814
H  0.310655 1.770427 -0.760637
H  0.613809 0.021735 -0.419499
H  -5.91318 1.901385 0.331996
H  -7.757872 0.643825 -1.098901
H  -6.982621 -1.82132 -1.77524
H  3.960518 2.928389 -2.72225
H  4.572317 1.297272 -2.233519
H  5.072476 2.776594 -1.304765
H  4.688841 -0.889277 1.331141
