program: Gaussian 09
title: 000182114
version: EM64L-G09RevD.01
frameworkgroup: C1[X(C8H7FO2)]
method: RPBEPBE
basis: SDD
operation: Freq
keyword: #pfreq=noraman
keyword: PBEPBE/SDD
title: #p freq=noraman PBEPBE/SDD
converged: YES YES NO YES
title: Mulliken charges:
elementType: F O O C C C C C C C C H H H H H H H
charge: -0.203387 -0.444853 -0.248259 0.360512 0.134844 -0.365671 -0.464450 -0.776070 -0.364515 0.348133 0.113547 0.242176 0.306089 0.250063 0.213588 0.250183 0.260833 0.387237
chargesum: 0.00000
title: Mulliken charges with hydrogens summed into heavy atoms:
elementType: F O O C C C C C C C C
charge: -0.203387 -0.057616 -0.248259 0.360512 0.134844 -0.123496 -0.158360 -0.062237 -0.103682 0.348133 0.113547
polarizability: 1.24973940e+02 1.89309973e+00 1.07585049e+02 1.81500587e-03 -5.67391953e-03 4.19773092e+01
1716.lowfreq: -11.6668 -8.4167 -3.8746 -0.0007 -0.0005 0.0003 44.7540 120.6393 160.8284
frequency: 44.7475 120.6381 160.8273 168.7995 198.3442 305.9499 333.9304 373.8290 383.7381 428.1415 450.3086 504.4911 521.6831 597.6856 615.1926 686.6935 697.0182 744.5991 758.4289 824.3833 902.3851 911.8662 953.5446 994.6095 1007.0160 1043.7983 1104.3009 1148.7747 1186.2948 1215.4615 1269.6333 1307.5981 1375.0110 1397.4206 1406.6463 1454.5928 1466.2520 1484.9015 1581.7874 1614.9443 1640.1828 2992.9678 3077.5414 3093.5558 3144.6184 3177.1486 3196.5128 3532.5605
redmass: 8.9508 3.7928 5.2481 1.0571 8.1715 4.1167 4.3965 6.6855 6.5059 3.0584 7.9689 4.1665 2.8390 1.3054 4.8231 3.5573 6.7000 4.5832 4.9091 1.3307 6.4533 1.4969 1.3391 2.1811 2.1159 1.5643 1.5945 1.2993 2.3308 5.0872 1.3488 2.6875 4.8459 4.3456 1.2520 1.0451 1.1484 3.1271 7.6585 6.9007 8.2286 1.0365 1.0960 1.1014 1.0896 1.0964 1.0927 1.0642
irintensity: 1.4685 0.0666 0.6160 0.7286 1.8639 0.8702 5.7181 1.9773 6.7281 12.2628 6.3469 8.6903 0.1166 149.7327 39.4146 12.3382 10.1830 8.3767 19.1712 33.2461 30.3951 25.5504 0.0616 145.5670 90.5272 10.3507 136.2340 29.9842 28.6576 26.8819 10.9575 74.9940 26.6386 6.6582 18.4788 12.8463 15.9185 92.9944 62.0872 37.4968 204.5831 15.8222 8.9705 23.6294 11.2952 3.5774 5.0193 49.2000
temp: 298.150 k
press: 1.00000 atm
elementType: 9 8 8 6 6 6 6 6 6 6 6 1 1 1 1 1 1 1
symmnumber: 1
zpe: 344532.6 jmol-1
zpe.correction: 0.131226 hartree
zpe.thermalcorrener: 0.141037 hartree
zpe.thermalcorrenthalpy: 0.141981 hartree
zpe.thermalcorrgfe: 0.095678 hartree
zpe.sumelectzpe: -558.561260 hartree
zpe.sumelectthermal: -558.551448 hartree
zpe.sumelectthermalent: -558.550504 hartree
zpe.sumelectthermalfe: -558.596808 hartree
dipole: -0.1733 1.1359 0.0017
dipole: 1.1490
quadrupole: -67.7715 -54.8283 -64.4966
quadrupole: 9.9708 -0.0084 0.0023
quadrupole: -5.4060 7.5372 -2.1312 9.9708 -0.0084 0.0023
hfenergy: -558.6924855 hartree
pointgroup: C01 [X(C8H7F1O2)]
dipole: 0.0562868 -0.4484217 0.0101725 debye
dipolederiv: -0.8210318 0.4231062 -0.0207761 0.4998836 -0.5309665 0.0167014 -0.0222224 0.0152415 -0.1525162 -0.3278231 -0.1665186 0.0048742 -0.283062 -1.3463759 0.0112256 0.0069218 0.0133314 -0.428246 -1.0706719 0.1413918 -0.0167163 0.037952 -0.653671 0.0069385 -0.0150652 0.0088208 -0.3077103 0.235387 -0.3456393 0.0113567 -0.0051869 0.1213018 -0.0026645 0.0051676 -0.009273 -0.0069822 -0.5418065 -0.3145489 -0.004201 -0.1418976 -0.1139112 -0.0008365 -0.0074752 -0.0041124 -0.0133073 -0.1592326 0.2435472 -0.0045836 0.0303188 0.1085649 -0.0044948 -0.0005967 -0.0003662 -0.1619408 -0.0651748 0.3168858 -0.0049396 -0.1057527 -0.110016 -0.002143 0.00289 0.005919 -0.1180828 -0.1136493 0.2413276 -0.0073635 0.0933687 0.0454963 0.0014837 -0.0045842 0.0044377 0.02754 -0.0122274 -0.0183962 0.0024837 0.1723338 -0.0076891 0.0011464 -0.0010446 -0.0025127 -0.1225463 0.8424433 -0.6206728 0.0263223 -0.6422467 0.4380539 -0.0190511 0.0266883 -0.0186821 0.0781131 1.6107394 0.241444 0.0215025 0.3504485 1.6409031 -0.0188893 0.019724 -0.0209736 0.2213924 0.0800537 0.0001501 -0.0013751 -0.0356209 -0.0977511 0.0040007 -0.0007227 0.0047377 0.1510364 0.1435356 0.0036562 -0.0008217 0.0123524 0.0479035 0.0027821 -0.0009113 0.0025966 0.1828332 0.0384919 0.0199303 -0.0820314 0.0027789 0.0634209 -0.0444016 -0.0922652 -0.0094546 -0.0177246 0.0450346 -0.1540002 0.0017424 -0.0274982 -0.1418455 0.0042153 -0.0006849 0.0018086 0.1059852 0.0317172 0.0228204 0.0831745 0.0046921 0.0655971 0.0413869 0.0940576 0.0071856 -0.0126444 -0.0291776 -0.0358796 -0.0032941 -0.0431208 0.0957234 0.0006835 -0.0031499 0.0008064 0.1764204 0.1133923 0.001396 -0.0053539 0.0802569 0.3752615 0.0019166 -0.0067269 0.0004892 0.3983803 unknown
polarizability: 125.0316502|1.4588683|107.4750357|1.5619997|-1.197753|42.0296123 unknown
InChI: InChI=1S/C8H7FO2/c1-5-2-3-6(9)4-7(5)8(10)11/h2-4,10H,1H3
charge 0 multiplicity 1
18 atoms
F  -3.013598 1.418875 -0.038601
O  1.842674 2.153058 0.041595
O  2.942555 0.118087 0.098745
C  0.277679 -1.251433 0.074689
C  0.482008 0.168178 0.051856
C  -1.06202 -1.722213 0.057758
C  -0.625874 1.059546 0.013936
C  1.407629 -2.262198 0.116123
C  -2.170176 -0.85028 0.020077
C  -1.919536 0.532007 -0.000974
C  1.854618 0.745277 0.067082
H  -1.238631 -2.80288 0.074698
H  -0.462315 2.138831 -0.003144
H  2.047708 -2.120973 1.004352
H  1.002602 -3.288356 0.12793
H  2.082258 -2.154831 -0.751037
H  -3.197672 -1.225248 0.00729
H  2.783891 2.474054 0.053421
