program: Gaussian 09
title: 000196017
version: EM64L-G09RevD.01
frameworkgroup: C1[X(C12H17NO8)]
method: RPBEPBE
basis: SDD
operation: Freq
keyword: #p
keyword: freq=noraman
keyword: PBEPBE/SDD
title: #p freq=noraman PBEPBE/SDD
converged: YES YES NO NO
title: Mulliken charges:
elementType: O O O O O O O O N C C C C C C C C C C C C H H H H H H H H H H H H H H H H H
charge: -0.282167 -0.287756 -0.471138 -0.457282 -0.467737 -0.457394 -0.190569 -0.259497 -0.213850 -0.170041 -0.096797 -0.128224 -0.014570 -0.009183 -0.402710 -0.271598 -0.366492 0.193196 0.273556 -0.258719 -0.233050 0.223469 0.215979 0.253406 0.222411 0.202683 0.222747 0.218516 0.373939 0.368818 0.219886 0.259319 0.366714 0.254987 0.237679 0.378979 0.274727 0.277761
chargesum: 0.00000
title: Mulliken charges with hydrogens summed into heavy atoms:
elementType: O O O O O O O O N C C C C C C C C C C C C
charge: -0.282167 -0.287756 -0.097199 -0.088464 -0.101023 -0.078415 -0.190569 -0.259497 -0.213850 0.053428 0.119183 0.125182 0.207841 0.193499 0.038553 0.207608 0.126174 0.193196 0.273556 0.016008 0.044711
polarizability: 1.46241641e+02 -1.16330271e+01 1.72723811e+02 -1.15645202e+00 -8.98894852e+00 1.49220543e+02
1716.lowfreq: -0.0010 -0.0007 -0.0003 5.7902 7.9251 9.5111 25.0919 32.0081 57.7063
frequency: 25.0741 31.9567 57.6981 75.5419 89.9070 97.7501 112.6194 136.4143 143.8156 168.8501 189.0510 192.1757 220.1050 244.7362 256.6153 269.0902 291.1638 296.8885 302.3677 337.3011 349.2142 373.6259 393.2749 412.3375 436.7800 458.8590 466.8479 500.8833 511.9631 548.8799 558.9524 564.3740 587.9950 596.4508 630.0307 667.6314 686.8366 705.2980 732.7907 748.6773 812.3699 819.1304 835.7457 862.3035 923.8164 936.0732 938.1189 953.4311 964.1621 975.4416 982.5148 1010.5610 1012.6591 1038.1075 1039.9688 1052.6480 1064.5987 1080.4433 1095.3121 1106.3974 1125.2318 1138.1840 1159.1640 1171.1824 1202.9971 1216.8312 1235.2285 1246.3259 1260.3572 1267.7734 1283.8556 1288.7432 1298.8704 1314.5450 1320.6399 1341.1797 1355.3890 1358.4113 1365.5670 1368.2728 1380.8607 1386.1308 1388.5537 1390.1118 1393.4451 1452.4951 1454.2598 1463.5765 1583.1027 1616.6095 1677.4711 2894.4955 2942.8866 2955.3060 2977.6070 2992.5676 2998.0748 3012.6444 3013.8191 3072.1801 3076.0067 3089.1174 3206.5034 3235.0554 3403.1222 3496.6816 3554.5436 3573.5128
redmass: 6.8358 7.1326 6.8841 6.8187 6.3166 6.6198 6.8863 6.8524 5.8504 5.6791 3.8109 4.0228 3.4018 4.3900 3.5136 3.6195 4.3947 4.4567 4.3779 5.2978 7.5453 3.6229 5.0641 1.4227 3.0021 3.4651 1.1753 1.2080 3.2597 2.9916 3.9909 3.1576 1.3769 4.2464 2.2766 3.9656 6.7625 4.8062 7.0546 5.5086 2.3052 2.9902 3.3272 2.6769 2.6986 2.4960 1.3162 2.5644 6.2555 3.0407 4.9037 4.6149 5.4560 3.3290 1.5769 2.7277 2.8598 2.8164 2.8928 2.8378 2.8705 2.4921 2.0665 1.3198 1.2296 1.1713 1.1603 1.2188 1.2294 1.2412 1.6585 1.1838 1.3597 1.3569 1.2274 1.2663 1.4210 1.2755 1.7058 1.4567 2.2652 1.4565 1.5555 1.4012 1.4660 1.0886 1.1198 1.0875 7.0010 10.6713 10.6476 1.0828 1.0819 1.0835 1.0843 1.0635 1.0590 1.0623 1.0837 1.1047 1.0998 1.1039 1.0898 1.1107 1.0684 1.0647 1.0656 1.0659
irintensity: 0.8791 0.2335 1.1335 2.8226 1.1771 2.0537 2.4941 15.8624 3.8446 2.5120 8.8227 1.3906 9.9123 2.4238 4.1627 2.5195 9.1613 0.5744 13.6063 0.4138 19.0527 3.0377 3.9261 122.5945 21.1190 26.1944 136.5067 136.4016 42.7585 27.3675 13.8651 18.5233 108.8027 17.6361 0.6098 55.1734 32.3217 8.9632 1.5996 19.7495 16.4048 100.4734 9.1427 10.0274 13.6352 59.4714 1.1463 36.1461 77.1679 51.9613 17.9752 37.8607 129.6796 165.4649 15.6529 8.8421 18.9760 101.3941 40.0428 18.9082 28.5270 1.5107 12.6833 76.5970 3.9618 24.2164 19.0284 3.3654 12.0059 9.7779 1.1948 15.5069 21.4504 16.3958 13.6501 14.0703 17.1002 27.0285 29.5529 51.9221 106.1001 22.3177 14.0571 41.2671 11.8803 12.9806 24.1976 15.5334 15.5111 460.3330 14.2482 53.5670 6.4122 40.9808 57.9125 43.6314 25.3715 49.1680 43.7235 7.7799 45.7027 6.7070 0.0990 0.1718 212.9118 28.7188 26.7906 18.0637
temp: 298.150 k
press: 1.00000 atm
elementType: 8 8 8 8 8 8 8 8 7 6 6 6 6 6 6 6 6 6 6 6 6 1 1 1 1 1 1 1 1 1 1 1 1 1 1 1 1 1
symmnumber: 1
zpe: 771436.5 jmol-1
zpe.correction: 0.293825 hartree
zpe.thermalcorrener: 0.314219 hartree
zpe.thermalcorrenthalpy: 0.315163 hartree
zpe.thermalcorrgfe: 0.244836 hartree
zpe.sumelectzpe: -1122.349440 hartree
zpe.sumelectthermal: -1122.329046 hartree
zpe.sumelectthermalent: -1122.328102 hartree
zpe.sumelectthermalfe: -1122.398428 hartree
dipole: 0.1588 -2.3675 -0.5312
dipole: 2.4315
quadrupole: -119.6144 -134.6691 -118.2277
quadrupole: 2.0473 1.2000 14.1516
quadrupole: 4.5560 -10.4987 5.9427 2.0473 1.2000 14.1516
hfenergy: -1122.6432644 hartree
pointgroup: C01 [X(C12H17N1O8)]
dipole: -0.1799794 -0.7212985 0.6020725 debye
polarizability: 150.6793226|14.8377095|170.1152318|-6.8934264|-3.0654252|147.3914402 unknown
InChI: InChI=1S/C12H17NO8/c14-5-6-9(17)10(18)11(19)12(21-6)20-4-3-13-7(15)1-2-8(13)16/h1-2,6,9-12,14,17-19H,3-5H2
charge 0 multiplicity 1
38 atoms
O  0.72562 0.585977 0.331462
O  -0.221162 -1.050339 1.737715
O  3.829147 -1.995111 -0.775741
O  2.309078 -0.186164 -2.12232
O  2.176727 -2.693496 1.459015
O  0.863575 3.463665 -0.33381
O  -3.19624 -1.95846 -0.438385
O  -1.725899 2.403258 0.474496
N  -2.511565 0.162712 0.402286
C  3.126267 -1.007748 0.051505
C  2.897148 0.22737 -0.848754
C  1.802769 -1.585817 0.573288
C  1.964645 1.243674 -0.157473
C  1.019602 -0.48216 1.295739
C  1.507226 2.386989 -1.07424
C  -1.104915 -0.103785 2.455049
C  -2.508965 -0.169305 1.830616
C  -2.807173 -0.782074 -0.627125
C  -2.081071 1.376718 -0.167464
C  -2.569025 -0.067087 -1.931338
C  -2.141688 1.195657 -1.662119
H  3.748766 -0.725681 0.927784
H  3.880664 0.716224 -1.024101
H  1.175904 -1.93684 -0.271472
H  2.501889 1.680543 0.714514
H  1.600957 -0.055038 2.149914
H  0.860379 1.964317 -1.868469
H  2.391207 2.840615 -1.554231
H  3.81853 -2.858072 -0.286659
H  2.796394 -1.012319 -2.388643
H  -1.164591 -0.415161 3.515124
H  -0.700233 0.920363 2.383837
H  1.345926 -3.099453 1.814353
H  -2.915256 -1.193181 1.908564
H  -3.176336 0.519829 2.381652
H  -0.031095 3.167433 -0.002667
H  -2.728835 -0.553234 -2.893314
H  -1.873172 1.99668 -2.350992
