program: Gaussian 09
title: 000182111
version: EM64L-G09RevD.01
frameworkgroup: C1[X(C21H16N2O)]
method: RPBEPBE
basis: SDD
operation: Freq
keyword: #p
keyword: freq=noraman
keyword: PBEPBE/SDD
title: #p freq=noraman PBEPBE/SDD
converged: NO YES NO NO
title: Mulliken charges:
elementType: O N N C C C C C C C C C C C C C C C C C C C C C H H H H H H H H H H H H H H H H
charge: -0.282574 -0.510569 -0.510568 0.424291 0.424296 0.386605 0.386605 0.502187 0.502173 -0.679602 -0.679600 -0.425165 -0.425183 -0.357899 -0.357888 -0.422133 -0.422134 -0.411552 -0.411553 0.273639 -0.242255 -0.242255 -0.247237 -0.247238 0.221681 0.221682 0.237374 0.237374 0.309180 0.309188 0.234106 0.234106 0.241088 0.241088 0.290140 0.290141 0.226531 0.226531 0.227700 0.227700
chargesum: 0.00000
title: Mulliken charges with hydrogens summed into heavy atoms:
elementType: O N N C C C C C C C C C C C C C C C C C C C C C
charge: -0.282574 -0.220428 -0.220427 0.424291 0.424296 0.386605 0.386605 0.502187 0.502173 -0.457922 -0.457918 -0.187791 -0.187809 -0.048719 -0.048700 -0.188027 -0.188028 -0.170464 -0.170464 0.273639 -0.015724 -0.015724 -0.019537 -0.019539
polarizability: 5.50094123e+02 9.18772241e-04 2.41743687e+02 1.30320489e-02 -7.60765052e-03 9.23531771e+01
1716.lowfreq: -0.0012 -0.0005 0.0010 5.4481 9.9544 18.9227 29.7119 30.4994 50.8458
frequency: 25.6429 29.6176 50.8458 57.2466 63.8873 129.7860 142.2449 147.6690 167.5660 185.5444 186.4927 261.7455 287.1171 301.6896 309.2114 384.0560 398.5356 404.1245 420.9654 459.5312 460.1639 475.7553 476.4651 514.4226 515.8201 533.9693 550.0418 558.3468 618.6647 625.3280 628.3922 658.1051 659.9678 692.8641 693.7099 753.3452 757.8867 758.4061 760.5085 779.4115 779.9064 780.7143 794.4641 837.6874 838.5197 867.7430 869.8251 887.4923 894.3569 900.1909 900.8531 943.3058 945.6794 960.3662 960.6100 987.7788 987.8703 999.9828 1001.1204 1019.0914 1021.7917 1031.3928 1123.2549 1128.9285 1160.6350 1161.4853 1165.4854 1172.6146 1174.9448 1204.3807 1210.0131 1242.9423 1243.8291 1277.8097 1278.1719 1289.0968 1314.3213 1337.8712 1350.0362 1398.7793 1403.1879 1417.4364 1419.8278 1437.9058 1438.2598 1463.6272 1465.0002 1494.9043 1505.3303 1535.7345 1536.2037 1584.7893 1586.6125 1605.8818 1610.7667 1641.1743 1641.4201 1658.3538 3093.1136 3093.2390 3115.5741 3115.5835 3121.8399 3121.8555 3130.3959 3130.4591 3139.3515 3139.3679 3159.4049 3159.4894 3198.5646 3198.8449 3517.8576 3530.4951
redmass: 6.0827 4.0155 5.8934 5.3144 8.4067 4.8967 3.4895 5.5453 7.1594 3.7828 3.7699 5.9534 3.0068 4.3153 9.7550 4.6539 2.7134 3.1718 4.4219 1.7806 7.6499 2.4476 2.4210 6.8847 6.7203 3.1787 3.0622 7.2384 6.6960 1.2711 6.7511 2.8095 2.7140 6.7214 10.4657 4.9705 1.3324 1.3340 4.8917 6.6538 2.3276 2.3474 6.0161 1.2650 1.2628 1.5662 1.5643 5.9361 5.1761 1.9309 1.9276 4.5470 4.2136 1.3856 1.3872 1.3271 1.3277 1.3377 1.3326 2.7561 2.2582 3.0378 1.7897 1.6731 1.4653 1.2274 1.4924 1.0773 1.2133 1.4623 1.4846 1.7123 1.6204 1.8348 1.7596 2.2924 2.5336 2.1911 2.0033 2.7567 3.6523 4.0256 3.6752 5.0137 4.8333 2.2721 2.1802 2.6797 2.8784 2.7158 2.8530 5.9801 6.2577 5.4041 5.2439 6.5172 6.7944 3.9560 1.0911 1.0911 1.0860 1.0860 1.0887 1.0887 1.0907 1.0907 1.0947 1.0947 1.1003 1.1003 1.0945 1.0943 1.0765 1.0754
irintensity: 0.0091 0.0000 0.0001 0.0000 9.8256 5.3924 0.0000 8.1025 0.0118 0.0000 3.1989 0.7039 0.0000 0.2196 14.9265 6.5120 0.0000 0.1479 1.8281 0.0001 9.3417 45.8501 0.0000 3.9279 0.0007 9.0439 0.0000 0.0015 3.7157 146.5996 0.6618 0.0000 2.0877 0.0001 29.3584 0.0049 0.0001 80.3128 0.0124 2.9786 0.0000 7.3785 0.0154 0.0000 9.0791 0.0001 218.3014 0.0001 3.6765 0.0000 16.7928 0.0081 7.8197 0.0000 22.4647 0.0000 0.0027 0.0000 0.9234 0.8165 14.2114 0.1079 25.3671 17.2299 62.8423 4.8004 119.2740 1.6044 89.0619 300.2933 13.0032 118.1940 1.5356 21.9747 9.4569 456.9854 0.4260 31.3731 241.0488 1.3161 180.4601 0.1204 175.9777 0.4554 88.1770 38.4788 3.4891 1387.5876 5.9157 99.5322 10.4830 33.7423 22.6020 246.8647 0.0750 27.8097 194.3982 107.0192 26.4571 21.8121 3.5591 9.9664 0.0047 0.0761 0.0379 19.5634 1.5795 69.7360 88.6478 2.2413 30.3250 0.1452 7.9388 10.7615
temp: 298.150 k
press: 1.00000 atm
elementType: 8 7 7 6 6 6 6 6 6 6 6 6 6 6 6 6 6 6 6 6 6 6 6 6 1 1 1 1 1 1 1 1 1 1 1 1 1 1 1 1
symmnumber: 1
zpe: 823881.8 jmol-1
zpe.correction: 0.313800 hartree
zpe.thermalcorrener: 0.332477 hartree
zpe.thermalcorrenthalpy: 0.333421 hartree
zpe.thermalcorrgfe: 0.265560 hartree
zpe.sumelectzpe: -992.987854 hartree
zpe.sumelectthermal: -992.969177 hartree
zpe.sumelectthermalent: -992.968233 hartree
zpe.sumelectthermalfe: -993.036094 hartree
dipole: -0.0003 -3.6804 0.0006
dipole: 3.6804
quadrupole: -122.6298 -120.7767 -150.4476
quadrupole: -0.0002 0.0009 -0.0017
quadrupole: 8.6549 10.5080 -19.1629 -0.0002 0.0009 -0.0017
hfenergy: -993.3016538 hartree
pointgroup: C01 [X(C21H16N2O1)]
dipole: -0.0000619 -1.4479702 0.0002259 debye
polarizability: 550.0941228|0.0145943|241.7436874|0.0130324|-0.0076071|92.3531771 unknown
InChI: InChI=1S/C21H16N2O/c24-21(22-19-11-9-15-5-1-3-7-17(15)13-19)23-20-12-10-16-6-2-4-8-18(16)14-20/h1-14,22-23H
charge 0 multiplicity 1
40 atoms
O  -0.000604 1.544472 -0.000157
N  -1.165545 -0.510816 0.000116
N  1.16439 -0.510755 0.000179
C  -4.905297 -0.729235 -0.000118
C  4.904165 -0.728813 0.000162
C  -5.2844 0.66951 -0.000204
C  5.283118 0.669974 0.000115
C  -2.521928 -0.081442 -0.000028
C  2.520731 -0.081271 0.000116
C  -3.518379 -1.072463 -0.000039
C  3.517286 -1.072191 0.000142
C  -4.244627 1.655897 -0.000219
C  4.243242 1.65625 0.000062
C  -2.894835 1.307848 -0.000134
C  2.893486 1.308053 0.000073
C  -5.938602 -1.726787 -0.000113
C  5.937578 -1.726254 0.000214
C  -6.674794 1.017811 -0.000273
C  6.673475 1.018425 0.000121
C  -0.000595 0.28072 0.000039
C  -7.285686 -1.35728 -0.000186
C  7.28462 -1.356601 0.000222
C  -7.659473 0.026211 -0.000268
C  7.658259 0.026931 0.000176
H  -3.24068 -2.136414 0.000013
H  3.2397 -2.136171 0.000155
H  -4.523599 2.716546 -0.0003
H  4.522094 2.71693 0.000023
H  -2.110259 2.06545 -0.000167
H  2.108828 2.065574 0.000012
H  -5.655524 -2.78683 -0.000055
H  5.654612 -2.786327 0.000253
H  -6.954377 2.07849 -0.000337
H  6.952941 2.079135 0.000084
H  -1.04834 -1.526308 0.00029
H  1.047248 -1.526256 0.000293
H  -8.066907 -2.125852 -0.000184
H  8.065926 -2.125086 0.000267
H  -8.720553 0.299196 -0.000324
H  8.71931 0.300027 0.000183
