program: Gaussian 09
title: 000196015
version: EM64L-G09RevD.01
frameworkgroup: C1[X(C14H16N8O)]
method: RPBEPBE
basis: SDD
operation: Freq
keyword: #p
keyword: freq=noraman
keyword: PBEPBE/SDD
title: #p freq=noraman PBEPBE/SDD
converged: YES YES NO NO
title: Mulliken charges:
elementType: O N N N N N N N N C C C C C C C C C C C C C C H H H H H H H H H H H H H H H H
charge: -0.219201 -0.187978 -0.065681 -0.482716 -0.030707 0.026201 -0.132584 -0.353107 0.000625 -0.394968 -0.393964 -0.373986 -0.376815 0.386325 -0.613929 0.040260 -0.396206 0.368428 -0.221684 -0.377796 -0.310072 0.206893 -0.049273 0.215480 0.224030 0.240398 0.230368 0.213680 0.192765 0.214029 0.214049 0.193444 0.222529 0.225928 0.249023 0.229719 0.313029 0.403071 0.370393
chargesum: 0.00000
title: Mulliken charges with hydrogens summed into heavy atoms:
elementType: O N N N N N N N N C C C C C C C C C C C C C C
charge: -0.219201 -0.187978 -0.065681 -0.079645 -0.030707 0.026201 -0.132584 0.017285 0.000625 0.044542 0.076803 0.032459 0.051264 0.386325 0.027972 0.040260 -0.147183 0.368428 0.008034 -0.064767 -0.310072 0.206893 -0.049273
polarizability: 3.40744417e+02 -6.48469483e+00 2.37155822e+02 -1.83819155e+00 -5.22370607e-01 1.08985494e+02
1716.lowfreq: -6.2768 -0.0002 -0.0002 0.0007 2.0251 5.4283 26.4626 32.1190 37.9670
frequency: 26.3040 32.0992 37.9614 52.4171 69.6965 72.7864 112.5610 133.1723 139.9564 151.6608 188.5201 198.6662 225.0306 227.4097 239.0748 277.0339 280.4703 309.5650 312.9702 324.1525 351.0031 390.6541 414.8016 442.3247 467.1788 472.6711 490.4129 528.6792 561.6074 601.3884 610.5873 617.0334 636.8282 657.3346 668.2684 734.2204 737.3055 750.9050 769.5217 772.3597 801.5831 810.7051 847.7497 850.8456 858.9817 892.2086 899.8141 932.3436 948.7674 987.8080 989.0058 1005.0292 1010.9884 1049.0422 1065.6794 1072.0226 1080.2758 1083.2309 1117.6328 1126.8750 1138.1826 1146.4636 1153.9179 1176.3476 1185.4524 1199.1849 1202.3771 1209.5244 1224.4592 1250.1519 1287.3623 1292.6229 1298.5292 1339.5239 1349.2450 1359.2617 1370.2356 1375.2392 1392.2072 1396.2941 1411.2150 1431.6402 1443.9569 1455.5219 1457.2556 1458.9226 1462.6311 1474.5994 1480.5147 1481.6791 1540.4599 1573.5352 1601.0867 1629.5648 2141.5903 2853.1849 2866.2707 2882.3255 2932.0087 2940.3458 3022.4926 3028.5877 3038.1831 3067.8788 3079.9963 3112.3821 3141.4683 3173.3775 3207.0738 3396.0451 3600.9582
redmass: 5.8907 7.7712 5.6738 5.5341 5.4712 6.1603 5.5475 5.6072 5.9840 3.9074 7.5225 6.7584 1.4609 4.6709 1.9834 3.6755 4.7642 2.8111 7.5649 2.5337 3.4180 2.6630 3.1471 5.1647 6.8331 2.7430 8.0484 4.7645 5.1182 4.5110 4.7796 4.3608 9.9000 9.1515 3.6123 1.8242 1.5260 3.4406 5.7116 4.7347 1.5245 1.4534 1.5866 5.0745 7.2804 6.1065 1.3923 2.0537 10.1011 1.4394 3.5503 2.8817 3.8720 1.6644 1.8157 2.1402 2.0552 2.1935 6.4140 1.7102 4.8165 2.7706 3.5374 3.6965 2.6830 1.2237 1.3901 2.8174 2.6173 1.5063 1.5466 1.5293 1.8943 1.3715 1.8059 1.8288 1.5671 1.4805 2.1187 2.1354 2.6774 1.1779 5.8186 1.0897 1.1006 1.2530 1.0761 1.1055 2.2462 1.0541 2.2215 6.6695 6.0099 4.6242 12.5957 1.0685 1.0597 1.0672 1.0678 1.0709 1.0743 1.0888 1.0909 1.0930 1.1009 1.0905 1.0885 1.0940 1.0949 1.0779 1.0849
irintensity: 0.5052 2.4234 0.6956 0.8264 5.7946 4.8874 4.2453 2.3831 1.7026 10.9863 1.1166 1.7084 2.3131 0.7989 3.7040 7.2996 5.5419 7.0857 6.7927 4.6192 1.0995 0.3110 7.2107 7.0062 1.7458 2.4385 1.5361 2.7210 3.1550 0.6675 0.0910 3.0444 0.2726 7.2039 16.5033 9.3958 114.1464 18.0017 13.8653 0.8092 8.8368 133.5911 3.6339 5.0099 33.1993 2.4508 9.5882 2.2993 26.2423 5.4291 6.4042 83.2142 1.4044 9.2422 10.0271 3.7737 7.5322 4.9034 54.7674 20.3287 10.9008 49.7922 17.5983 24.3099 13.0500 7.3518 6.5885 7.0147 29.8634 132.2909 28.3671 66.4952 1.7044 31.6206 20.6579 25.6981 59.7913 12.8293 1.4267 27.8992 36.3513 0.9690 48.4353 9.1171 15.5069 188.2244 3.7873 19.0066 284.9827 8.3885 200.1872 129.2631 398.4319 79.1185 52.6432 51.2879 107.1561 102.5289 66.3757 90.2985 47.0779 57.4254 48.9102 21.5589 31.2465 6.4637 13.2245 12.2304 10.9456 46.8816 176.0026
temp: 298.150 k
press: 1.00000 atm
elementType: 8 7 7 7 7 7 7 7 7 6 6 6 6 6 6 6 6 6 6 6 6 6 6 1 1 1 1 1 1 1 1 1 1 1 1 1 1 1 1
symmnumber: 1
zpe: 791033.8 jmol-1
zpe.correction: 0.301289 hartree
zpe.thermalcorrener: 0.321534 hartree
zpe.thermalcorrenthalpy: 0.322479 hartree
zpe.thermalcorrgfe: 0.250729 hartree
zpe.sumelectzpe: -1054.585735 hartree
zpe.sumelectthermal: -1054.565489 hartree
zpe.sumelectthermalent: -1054.564545 hartree
zpe.sumelectthermalfe: -1054.636295 hartree
dipole: -1.7644 0.5466 0.1058
dipole: 1.8502
quadrupole: -96.0465 -141.1799 -135.1563
quadrupole: -17.6026 2.9253 -2.1173
quadrupole: 28.0810 -17.0523 -11.0288 -17.6026 2.9253 -2.1173
hfenergy: -1054.8870234 hartree
pointgroup: C01 [X(C14H16N8O1)]
dipole: -0.6940087 0.2186374 -0.0203404 debye
polarizability: 340.6484593|-6.0452881|231.36392|4.841727|-26.7617859|114.8733537 unknown
InChI: InChI=1S/C14H16N8O/c1-21-5-7-22(8-6-21)12-4-2-3-11(10(12)9-15)16-14(23)13-17-19-20-18-13/h2-4,16,19H,5-8H2,1H3
charge 0 multiplicity 1
39 atoms
O  3.736449 1.91793 -0.312197
N  -2.885529 0.445787 0.023646
N  -5.393597 -0.965447 0.249597
N  2.028892 0.302424 0.020441
N  -0.333569 -2.238302 0.2095
N  5.669304 -0.272837 0.12944
N  3.886087 -1.688339 0.460662
N  6.042098 -1.556069 0.410149
N  4.989897 -2.448444 0.618778
C  -4.123151 1.027885 -0.53821
C  -3.169125 -0.440069 1.183436
C  -5.102459 -0.101946 -0.916839
C  -4.142915 -1.55868 0.78386
C  -1.653611 1.099003 -0.13456
C  -6.420806 -1.982879 -0.047765
C  -0.40789 0.381884 -0.014394
C  -1.588206 2.484823 -0.466048
C  0.850443 1.069897 -0.140624
C  -0.348236 3.129304 -0.618032
C  0.877524 2.451825 -0.442451
C  -0.389214 -1.042374 0.127218
C  3.349282 0.740446 -0.06992
C  4.306351 -0.385889 0.168218
H  -4.616249 1.706536 0.193408
H  -3.878361 1.602613 -1.447468
H  -2.238998 -0.874261 1.575472
H  -3.638183 0.166626 1.989444
H  -6.048877 0.348644 -1.270513
H  -4.659931 -0.686214 -1.764552
H  -3.643619 -2.228176 0.039761
H  -4.390324 -2.161697 1.677021
H  -6.112772 -2.702377 -0.847544
H  -7.352746 -1.48657 -0.373188
H  -6.643626 -2.562172 0.865862
H  -2.510375 3.064843 -0.554319
H  -0.329729 4.199296 -0.852478
H  1.834067 2.964704 -0.540524
H  1.915274 -0.702568 0.225473
H  7.019231 -1.844958 0.464039
