program: Gaussian 09
title: 000196042
version: EM64L-G09RevD.01
frameworkgroup: C1[X(C10H15N5O10P2S)]
method: RPBEPBE
basis: SDD
operation: Freq
keyword: #p
keyword: freq=noraman
keyword: PBEPBE/SDD
title: #p freq=noraman PBEPBE/SDD
converged: YES YES NO NO
title: Mulliken charges:
elementType: S P P O O O O O O O O O O N N N N N C C C C C C C C C C H H H H H H H H H H H H H H H
charge: -0.107444 0.929443 1.483088 -0.316508 -0.433808 -0.557702 -0.585226 -0.689884 -0.623575 -0.207645 -0.635683 -0.631470 -0.690085 -0.229362 -0.432883 -0.012823 -0.056203 -0.620382 -0.128477 -0.176319 -0.084892 -0.046067 -0.324653 0.373735 -0.252508 -0.142235 0.016804 0.149383 0.249127 0.273521 0.309496 0.293216 0.255109 0.259518 0.376802 0.440234 0.265844 0.352065 0.309902 0.355364 0.427741 0.444989 0.420450
chargesum: 0.00000
title: Mulliken charges with hydrogens summed into heavy atoms:
elementType: S P P O O O O O O O O O O N N N N N C C C C C C C C C C
charge: -0.107444 0.929443 1.483088 -0.316508 -0.057006 -0.117468 -0.585226 -0.689884 -0.195834 -0.207645 -0.190694 -0.211019 -0.690085 -0.229362 -0.080818 -0.012823 -0.056203 0.044884 0.120650 0.097202 0.224605 0.247149 0.189974 0.373735 0.013336 -0.142235 0.016804 0.149383
polarizability: 2.61712309e+02 1.10020334e+01 2.73795691e+02 2.68781991e+01 5.51989594e+00 1.94112817e+02
1716.lowfreq: -9.1416 -7.7560 -2.6246 0.0003 0.0007 0.0018 10.7348 15.0752 28.9035
frequency: 10.3728 15.0060 28.7763 41.7222 66.1613 70.0004 93.1071 101.1773 107.2964 113.5997 117.8623 130.9061 161.9819 176.3237 180.4323 186.8721 198.1378 205.1558 215.0872 230.6024 241.6116 246.0206 280.6299 283.6454 287.0393 302.4511 305.5715 314.9280 326.0115 330.4077 333.2962 341.5662 367.6556 396.4019 401.8925 419.7728 445.1297 461.4374 471.8232 483.9427 498.8034 520.0210 535.8118 538.7725 570.6982 596.3919 607.0750 613.6579 631.7397 637.3051 644.1228 648.6400 681.9497 691.8685 717.2887 724.6146 740.2343 750.9239 774.1295 778.5599 787.6201 816.2033 830.6124 843.5685 861.0623 924.8420 932.5830 937.3590 966.6042 972.5809 986.2638 999.0347 1023.3400 1035.3089 1037.7988 1055.7467 1056.4335 1074.8129 1124.7277 1135.0573 1143.2136 1163.5754 1170.6836 1197.2668 1206.6534 1228.7940 1246.9404 1272.9146 1281.8152 1295.9259 1303.4580 1307.6480 1314.1589 1314.3828 1331.1530 1345.3012 1368.9523 1385.0586 1389.2544 1393.6585 1418.9580 1461.3849 1510.2577 1525.0120 1533.9439 1600.6421 1623.5782 1645.4424 2116.9957 2602.0531 3019.7295 3022.4424 3034.2101 3043.4416 3055.2907 3099.3788 3244.3141 3344.7834 3504.7204 3512.6365 3546.6152 3592.7033 3698.2395
redmass: 11.6942 6.9929 10.1379 8.7452 9.1089 12.0574 7.1560 10.2397 6.7794 8.2996 7.0411 4.8918 3.5076 6.6659 7.5506 7.6643 7.3951 5.7540 7.3779 2.3782 6.4564 8.2350 1.9337 7.4546 1.6822 6.7053 5.0594 5.7535 7.0102 4.6765 6.6686 6.0285 7.1046 6.8284 3.6474 7.4589 2.4942 1.7659 5.4380 7.7590 6.6679 7.5659 1.7673 2.1252 4.4473 1.4000 1.5734 2.0524 6.7717 12.2015 5.9713 9.9301 5.1351 7.7954 14.1451 1.6124 6.4564 13.2939 5.9985 7.2884 5.6303 3.0413 7.8166 13.5528 3.9842 2.9159 6.7332 6.5396 2.5484 2.3715 3.2657 4.2767 3.2336 2.5338 2.1064 1.3901 2.8716 2.9722 2.9464 1.2581 3.6458 3.3326 1.2813 1.4354 1.5179 1.1915 1.8098 1.3755 1.4087 1.2122 1.3862 1.3111 1.5628 1.3290 3.8504 1.2715 1.3154 1.5102 4.5769 1.4527 4.9961 1.0814 1.0987 5.6265 3.9823 1.6329 7.6484 3.7546 1.0909 1.0730 1.0591 1.0847 1.0873 1.0866 1.0878 1.1081 1.0976 1.0648 1.0788 1.0650 1.0454 1.0667 1.1048
irintensity: 4.2327 1.4214 2.5127 6.8496 1.4003 0.6157 1.2118 0.7183 3.9143 3.4852 1.2225 2.7082 19.7005 5.7225 9.4965 6.0984 2.5388 5.0124 17.9916 58.6434 5.3264 13.0879 38.3560 4.0515 57.2340 2.6280 27.3696 30.3912 27.1702 0.8808 4.3786 17.1221 26.8071 10.6316 8.2847 54.4971 51.3934 174.0028 52.1261 14.6841 14.1223 7.9378 217.8104 88.1546 24.2721 107.0963 96.7619 30.8190 13.5704 84.1325 1.7391 1.8503 32.5267 12.1469 247.5296 32.6997 26.4189 359.9466 22.2210 8.1904 233.7470 32.8093 24.3666 87.5171 32.6712 95.8643 85.6538 50.3004 385.7519 47.1298 183.1868 90.2211 6.1711 42.1084 98.5923 109.0412 80.7834 11.5614 42.2468 120.2947 27.6484 19.7654 63.6170 140.9698 14.0689 154.4113 4.2707 19.1041 25.6426 18.9679 86.2687 16.2358 10.7988 25.2975 40.9248 21.0294 57.5742 118.6441 121.5654 14.9118 35.8871 13.5615 83.2465 334.8882 122.2187 13.7436 639.7692 293.9699 1460.7541 2019.5298 16.4869 16.3687 12.3279 20.1360 8.9688 6.6774 0.3459 176.8226 109.9858 33.5294 91.6690 175.9278 44.1403
temp: 298.150 k
press: 1.00000 atm
elementType: 16 15 15 8 8 8 8 8 8 8 8 8 8 7 7 7 7 7 6 6 6 6 6 6 6 6 6 6 1 1 1 1 1 1 1 1 1 1 1 1 1 1 1
symmnumber: 1
zpe: 760906.1 jmol-1
zpe.correction: 0.289814 hartree
zpe.thermalcorrener: 0.317997 hartree
zpe.thermalcorrenthalpy: 0.318941 hartree
zpe.thermalcorrgfe: 0.229649 hartree
zpe.sumelectzpe: -2494.445031 hartree
zpe.sumelectthermal: -2494.416848 hartree
zpe.sumelectthermalent: -2494.415904 hartree
zpe.sumelectthermalfe: -2494.505196 hartree
dipole: 6.9858 3.0785 6.1695
dipole: 9.8154
quadrupole: -248.8569 -170.8599 -209.3818
quadrupole: -48.7323 -32.7051 -9.5808
quadrupole: -39.1574 38.8396 0.3178 -48.7323 -32.7051 -9.5808
hfenergy: -2494.7348444 hartree
pointgroup: C01 [X(C10H15N5O10P2S1)]
dipole: 1.854225 -0.2182459 -3.3803432 debye
polarizability: 245.4248708|13.2227776|249.876089|-32.5870395|37.6454875|234.3198566 unknown
InChI: InChI=1S/C10H15N5O10P2S/c11-10-13-7-4(8(18)14-10)12-2-15(7)9-6(17)5(16)3(24-9)1-23-27(22,28)25-26(19,20)21/h2-3,5-6,9,13,16-17,19-20,22H,1,11H2
charge 0 multiplicity 1
43 atoms
S  3.66729 -3.297621 -2.585089
P  3.405305 -1.443878 -1.81638
P  4.536385 0.181926 0.603933
O  -1.137462 0.251859 -1.455685
O  -0.080663 2.893635 -2.607643
O  2.194533 1.769732 -1.563401
O  2.190532 -1.190889 -0.506048
O  4.711465 -0.895983 -0.741136
O  3.087465 -0.181024 -2.866958
O  -4.643166 0.508786 3.994489
O  3.644344 -0.669758 1.755473
O  6.05058 0.196958 1.334483
O  4.014819 1.638822 0.180661
N  -2.023606 1.654434 0.273971
N  -3.346005 -0.467911 0.151156
N  -2.704829 2.334485 2.356507
N  -4.706446 -0.90138 2.111157
N  -4.73496 -2.380399 0.293728
C  -0.163396 2.454205 -1.225341
C  0.92587 1.386654 -0.93494
C  -1.473792 1.659162 -1.092473
C  0.336646 0.098634 -1.566413
C  0.739361 -1.197953 -0.832294
C  -2.910424 0.696423 0.763067
C  -1.949048 2.645191 1.300937
C  -3.319164 1.105037 2.040981
C  -4.251469 0.264253 2.824061
C  -4.278765 -1.223146 0.901866
H  -0.092218 3.309242 -0.528404
H  1.070318 1.263557 0.154658
H  -2.223816 2.001759 -1.825652
H  0.589309 0.05351 -2.640963
H  0.499347 -2.101346 -1.421465
H  0.231318 -1.251828 0.145036
H  0.879474 3.056914 -2.81103
H  2.940663 1.891156 -0.833748
H  -1.354425 3.548687 1.199451
H  -2.882199 -0.802619 -0.698077
H  -4.611885 -2.572151 -0.697304
H  -5.396874 -2.932988 0.83423
H  2.733843 0.734827 -2.408681
H  2.883067 -1.150685 1.305011
H  6.636575 0.955814 1.080772
