program: Gaussian 09
title: 000195970
version: EM64L-G09RevD.01
frameworkgroup: C1[X(C12H18N6O3)]
method: RPBEPBE
basis: SDD
operation: Freq
keyword: #p
keyword: freq=noraman
keyword: PBEPBE/SDD
title: #p freq=noraman PBEPBE/SDD
converged: YES YES NO NO
title: Mulliken charges:
elementType: O O O N N N N N N C C C C C C C C C C C C H H H H H H H H H H H H H H H H H H
charge: -0.229432 -0.220671 -0.215407 -0.560434 -0.447264 -0.115639 0.020245 -0.658452 -0.633427 -0.407644 -0.242880 -0.365811 -0.456473 0.149306 0.520427 -0.431574 -0.319009 -0.344691 -0.364352 0.390297 0.212845 0.184984 0.266238 0.208599 0.249717 0.171309 0.189384 0.198355 0.275127 0.286249 0.310610 0.231928 0.317312 0.286701 0.286505 0.334452 0.310632 0.293277 0.318658
chargesum: 0.00000
title: Mulliken charges with hydrogens summed into heavy atoms:
elementType: O O O N N N N N N C C C C C C C C C C C C
charge: -0.229432 -0.220671 -0.215407 0.000942 -0.136654 -0.115639 0.020245 -0.013368 -0.021492 0.043579 -0.034282 0.055216 -0.068734 0.149306 0.520427 -0.199645 -0.001697 -0.057990 -0.077848 0.390297 0.212845
polarizability: 3.02327443e+02 3.43155349e+01 1.40303583e+02 5.16692903e+00 2.66818203e+00 1.82629542e+02
1716.lowfreq: -9.3906 -2.6504 -0.0006 -0.0002 0.0001 3.7730 11.1755 21.2975 29.5987
frequency: 11.0779 21.0526 29.5239 33.9961 44.5778 59.0297 77.5175 88.8354 105.6343 131.8313 146.2583 162.6266 201.0299 209.6703 223.0699 228.8658 271.2953 282.0762 315.7513 327.5748 347.4858 359.9377 389.7051 402.4784 417.1489 420.4917 435.3804 469.3280 502.8078 508.6609 513.3343 553.3818 567.4355 620.8244 635.9357 662.5470 668.3383 674.4687 675.7881 703.4932 739.6764 759.5208 767.8782 780.5501 830.7017 837.2093 842.3120 881.8022 884.3255 911.8796 954.1072 971.3395 979.2175 998.7682 1009.9990 1013.0920 1031.7054 1047.8539 1082.1127 1096.2054 1117.5434 1121.0105 1136.0591 1151.5577 1179.1096 1180.7894 1214.8947 1225.9497 1249.9693 1263.9145 1270.9482 1293.6222 1298.1178 1304.2259 1344.7768 1350.3212 1358.9879 1362.7631 1385.9720 1409.2203 1428.7128 1455.6156 1460.1937 1476.6205 1485.6830 1503.4290 1594.9652 1601.2166 1612.5181 1614.9126 1632.5863 1651.2624 1671.5687 2868.2016 2911.6634 2947.8852 2969.3127 2977.1786 3039.8129 3072.9682 3127.1886 3179.0505 3185.4491 3200.8303 3437.6300 3507.8657 3524.5294 3551.2016 3557.7365 3672.7806 3697.1985
redmass: 6.9114 5.6040 3.6419 5.0085 4.0880 9.9165 5.5778 5.1901 5.6911 3.3343 3.3265 5.0473 1.6198 2.8007 2.7721 4.4926 3.0154 2.7528 4.1326 4.9109 4.6338 1.3870 2.2359 1.7533 3.0064 1.1805 2.0549 2.3475 3.1127 6.1294 3.0572 1.8621 1.7247 6.4400 6.4334 1.2573 4.6231 2.7553 2.8529 3.5192 4.5219 6.2160 1.5839 4.3572 5.7746 1.3840 2.0229 1.5518 2.5159 5.7249 2.7277 2.2518 1.3430 3.1236 1.6021 1.3153 1.4469 2.0409 2.3050 3.1661 1.3810 2.5675 1.5070 2.1345 1.4203 2.1197 1.3137 4.4099 1.5802 1.5506 1.6419 1.2172 1.4245 1.3496 1.4763 3.8569 1.5055 1.4246 5.2161 4.3251 5.1315 1.0875 1.0774 1.0917 2.3922 2.3571 7.2875 1.2245 5.3180 1.2798 5.1278 1.1018 3.6113 1.0548 1.1022 1.0840 1.0625 1.0666 1.0952 1.0980 1.0907 1.0905 1.0945 1.0962 1.0455 1.0758 1.0451 1.0455 1.0960 1.1018 1.1027
irintensity: 0.2009 1.6629 1.9773 3.1447 2.1372 5.4784 0.2426 2.9615 3.7809 0.2033 1.0511 2.2635 45.3517 4.8879 34.3744 3.1584 3.9788 9.9201 28.5218 9.1294 10.0425 77.0526 35.7255 135.0956 0.1448 129.1233 33.6833 26.8625 17.7621 2.3879 1.2880 157.5450 107.1805 9.2810 9.9880 58.1995 34.2821 7.3733 195.9915 68.4533 5.5115 148.1681 3.1303 47.7255 15.9420 30.4570 6.1078 67.0158 3.2518 5.4759 2.5217 28.8986 0.9436 0.1036 2.2207 0.3618 9.3402 1.7486 8.4543 12.0047 32.2945 217.4427 8.1810 56.9587 175.1915 7.9604 46.6990 451.6743 5.3936 22.7333 33.8169 35.4952 42.2172 4.3170 46.2986 70.9255 32.8809 36.4282 248.4966 121.0915 29.4691 23.2514 4.7832 14.9494 4.6903 450.0788 71.3067 145.4279 183.7570 73.3375 100.5431 65.0325 581.8573 80.5880 66.2572 39.2278 39.3374 62.5808 11.7562 34.4315 12.5968 2.3924 2.7156 4.7361 5.1872 17.5346 19.6901 19.7061 2.1741 19.7332 19.0957
temp: 298.150 k
press: 1.00000 atm
elementType: 8 8 8 7 7 7 7 7 7 6 6 6 6 6 6 6 6 6 6 6 6 1 1 1 1 1 1 1 1 1 1 1 1 1 1 1 1 1 1
symmnumber: 1
zpe: 812013.4 jmol-1
zpe.correction: 0.309280 hartree
zpe.thermalcorrener: 0.331164 hartree
zpe.thermalcorrenthalpy: 0.332109 hartree
zpe.thermalcorrgfe: 0.254463 hartree
zpe.sumelectzpe: -1020.604956 hartree
zpe.sumelectthermal: -1020.583071 hartree
zpe.sumelectthermalent: -1020.582127 hartree
zpe.sumelectthermalfe: -1020.659773 hartree
dipole: 8.8920 -0.2469 -3.6975
dipole: 9.6332
quadrupole: -149.7052 -120.7742 -113.1205
quadrupole: -33.1733 3.3818 -2.7007
quadrupole: -21.8386 7.0925 14.7461 -33.1733 3.3818 -2.7007
hfenergy: -1020.9142358 hartree
pointgroup: C01 [X(C12H18N6O3)]
dipole: 3.4888232 1.0345329 -1.0592607 debye
polarizability: 299.4452664|26.9550951|158.7998352|30.6511133|-19.3922076|167.0154663 unknown
InChI: InChI=1S/C12H18N6O3/c13-10(2-1-7-16-12(14)15)11(19)17-8-3-5-9(6-4-8)18(20)21/h3-6,10,17H,1-2,7,13-15H2
charge 0 multiplicity 1
39 atoms
O  0.0234 0.009917 2.207678
O  -6.499242 -0.701158 -1.815582
O  -6.321689 -2.037257 0.027313
N  2.229351 1.841493 2.398602
N  -0.713625 1.085993 0.249976
N  5.108993 -0.455558 -0.229066
N  -5.859234 -1.136207 -0.777453
N  6.954734 -1.001648 -1.716217
N  6.593762 -2.209412 0.263513
C  2.485865 0.853125 0.137713
C  1.552905 1.623928 1.116739
C  3.780082 1.621992 -0.192282
C  4.76756 0.754652 -1.003691
C  0.22397 0.826961 1.265554
C  -1.983935 0.504206 0.03763
C  -2.734236 0.948924 -1.090694
C  -2.529497 -0.49217 0.898823
C  -4.00193 0.416453 -1.362749
C  -3.800035 -1.025763 0.626236
C  -4.52644 -0.571299 -0.497423
C  6.156697 -1.168063 -0.571314
H  1.935035 0.622904 -0.797965
H  2.768866 -0.117174 0.589266
H  1.321836 2.618447 0.675529
H  4.258739 1.931893 0.753046
H  3.545238 2.542949 -0.766191
H  4.290213 0.483012 -1.976225
H  5.666069 1.372897 -1.247162
H  1.675622 2.388358 3.067925
H  2.535802 0.957215 2.822603
H  -0.429099 1.788408 -0.438927
H  -2.316918 1.715703 -1.754954
H  -1.949981 -0.826608 1.760404
H  -4.590723 0.744743 -2.222874
H  -4.239882 -1.791011 1.271136
H  6.668676 -0.338428 -2.430151
H  7.919806 -1.324265 -1.721427
H  6.980009 -3.055324 -0.153678
H  6.065939 -2.310129 1.129145
