program: Gaussian 09
title: 000195962
version: EM64L-G09RevD.01
frameworkgroup: C1[X(C10H12ClN5O4)]
method: RPBEPBE
basis: SDD
operation: Freq
keyword: #p
keyword: freq=noraman
keyword: PBEPBE/SDD
title: #p freq=noraman PBEPBE/SDD
converged: YES YES NO NO
title: Mulliken charges:
elementType: Cl O O O O N N N N N C C C C C C C C C C H H H H H H H H H H H H
charge: -0.045938 -0.276331 -0.451444 -0.416195 -0.180007 -0.208880 -0.656899 -0.356968 -0.026071 0.081237 -0.203967 -0.081649 -0.145799 -0.175865 -0.332542 0.338991 -0.211650 -0.124868 0.039332 -0.200947 0.292247 0.264071 0.271808 0.286200 0.207131 0.236747 0.319783 0.317027 0.375374 0.274505 0.436314 0.355251
chargesum: 0.00000
title: Mulliken charges with hydrogens summed into heavy atoms:
elementType: Cl O O O O N N N N N C C C C C C C C C C
charge: -0.045938 -0.276331 -0.076070 -0.060944 -0.180007 -0.208880 -0.020089 0.079346 -0.026071 0.081237 0.088280 0.182423 0.126009 0.110335 0.111336 0.338991 0.062856 -0.124868 0.039332 -0.200947
polarizability: 2.07256634e+02 6.11012070e-01 1.92037955e+02 -8.24726202e+00 4.52203605e+00 9.61123730e+01
1716.lowfreq: -17.1121 -4.8033 -2.4820 -0.0011 0.0010 0.0017 21.5167 34.3687 66.5100
frequency: 18.0057 34.3526 66.4993 79.6698 87.6590 100.7058 115.6143 155.6951 163.1956 204.4713 219.9424 231.1303 263.3368 273.0431 290.5592 302.0074 321.2201 330.6597 338.8639 359.8119 380.4072 406.0068 441.8478 478.5759 498.2980 561.6863 598.0609 615.1136 622.8344 639.0501 644.3995 650.9073 712.6563 741.8669 759.5084 776.8594 789.5514 811.3728 845.1475 863.5447 916.6474 931.9408 938.4459 958.4082 968.6563 987.7998 1024.3422 1040.0337 1053.7077 1062.1094 1067.1255 1123.8121 1128.8192 1171.6489 1176.1177 1181.2464 1187.7300 1195.0846 1226.6739 1259.4037 1263.8440 1281.7954 1305.8947 1309.7771 1323.4449 1340.0867 1350.6618 1362.5454 1378.6926 1380.5559 1393.9032 1430.4886 1456.3021 1543.3855 1575.7434 1599.6753 1653.2420 1660.9081 2830.0860 2954.7715 2969.2247 3038.2712 3053.7592 3070.4919 3076.9428 3262.0432 3398.4473 3510.8871 3552.6052 3558.9054
redmass: 6.5178 7.7978 8.0318 4.9471 5.3038 5.1759 6.2235 5.1302 9.8461 5.6418 5.8039 3.8204 3.1355 3.1194 7.4261 2.6099 4.1698 4.5939 6.8834 3.2442 3.6886 1.3140 1.4474 8.1007 3.2972 3.9209 5.9593 6.6306 7.2062 6.9285 7.9448 10.9588 4.8641 7.2437 2.8689 4.1243 2.1144 3.7825 3.7117 8.7978 1.8894 5.4852 3.0484 3.7001 2.4568 3.3580 2.2995 4.0539 2.5014 1.3041 2.3244 3.5291 3.3333 2.3950 1.3091 1.5231 1.5921 1.6301 1.6083 1.5283 3.1562 1.4036 1.3684 1.5158 3.3142 1.1920 1.4557 1.2587 1.3485 2.0842 1.9939 2.9646 1.0859 8.1022 2.0269 9.7796 1.0926 11.0800 1.0985 1.0684 1.0855 1.0857 1.0869 1.0923 1.0922 1.0982 1.0475 1.0935 1.0658 1.0665
irintensity: 2.3300 1.9907 2.7453 3.2165 6.6206 5.1914 0.7497 1.9078 3.8560 50.1856 1.6824 27.4247 22.9579 27.1912 3.2287 28.3292 9.7707 22.1652 9.0349 2.5934 5.4669 148.2915 7.1545 13.3777 3.7709 0.3680 3.5433 30.8867 5.8696 16.0442 4.8268 1.9463 2.1724 3.3599 26.2327 21.3653 11.7871 1.9016 33.4600 131.3720 180.1191 39.9193 44.7310 34.5065 96.7492 92.1306 15.1250 104.8842 1.1397 78.9931 32.8726 124.1451 86.8063 93.0375 62.1450 18.7802 45.6084 45.2866 4.1054 0.4221 0.2842 6.0124 5.5299 8.0352 111.0963 34.4436 4.4024 10.0037 38.3072 40.1575 3.8805 15.1677 5.2628 98.4372 369.0928 471.4011 73.5633 291.8493 1311.3776 48.5085 25.6920 11.0337 10.3448 13.6783 33.9063 0.6916 11.5684 18.6923 6.8418 20.9000
temp: 298.150 k
press: 1.00000 atm
elementType: 17 8 8 8 8 7 7 7 7 7 6 6 6 6 6 6 6 6 6 6 1 1 1 1 1 1 1 1 1 1 1 1
symmnumber: 1
zpe: 611777.9 jmol-1
zpe.correction: 0.233014 hartree
zpe.thermalcorrener: 0.251326 hartree
zpe.thermalcorrenthalpy: 0.252270 hartree
zpe.thermalcorrgfe: 0.185293 hartree
zpe.sumelectzpe: -1421.445823 hartree
zpe.sumelectthermal: -1421.427511 hartree
zpe.sumelectthermalent: -1421.426567 hartree
zpe.sumelectthermalfe: -1421.493543 hartree
dipole: 11.0142 7.9091 -0.4772
dipole: 13.5681
quadrupole: -163.6704 -140.7338 -116.8272
quadrupole: -8.1806 0.5340 3.9006
quadrupole: -23.2599 -0.3234 23.5833 -8.1806 0.5340 3.9006
hfenergy: -1421.6788365 hartree
pointgroup: C01 [X(C10H12Cl1N5O4)]
dipole: -4.6082378 2.6879773 -0.1849647 debye
polarizability: 205.98729|-2.6653308|184.4187666|-13.7526411|-26.3670458|105.0009056 unknown
InChI: InChI=1S/C10H12ClN5O4/c11-10-14-7-5(8(19)15-10)13-2-16(7)9-4(12)6(18)3(1-17)20-9/h2-4,6,9,14,17-18H,1,12H2
charge 0 multiplicity 1
32 atoms
Cl 3.328802 2.804766 -1.316215
O  -2.484672 -0.399991 1.091149
O  -3.505148 2.417174 0.457415
O  -4.096785 -2.446784 -0.265517
O  4.263135 -2.057444 0.001305
N  -0.140154 -0.535442 0.585965
N  -0.875948 2.446365 -0.640185
N  1.517622 1.084496 -0.325153
N  1.244969 -2.34208 0.845562
N  3.73186 0.182469 -0.573071
C  -1.628665 1.175475 -0.557779
C  -1.290011 0.374964 0.742753
C  -3.179333 1.302408 -0.447815
C  -3.593399 -0.064507 0.113123
C  -3.730257 -1.196569 -0.919641
C  1.124608 -0.150932 0.159385
C  -0.000139 -1.884293 1.015853
C  1.976821 -1.262002 0.309537
C  3.394962 -1.160294 -0.06943
C  2.865459 1.130908 -0.664696
H  -1.371195 0.557935 -1.437308
H  -1.074363 1.072251 1.579026
H  -3.657709 1.546499 -1.410064
H  -4.513692 -0.022107 0.721934
H  -2.795688 -1.308301 -1.50999
H  -4.563295 -0.975893 -1.609201
H  -1.26733 3.136734 0.019989
H  -0.889953 2.842244 -1.590752
H  -3.611429 2.079001 1.383616
H  -0.836484 -2.435199 1.434291
H  0.79799 1.859505 -0.449278
H  -3.39638 -2.670954 0.400191
