program: Gaussian 09
title: 000196119
version: EM64L-G09RevD.01
frameworkgroup: C1[X(C13H19N6O9P)]
method: RPBEPBE
basis: SDD
operation: Freq
keyword: #p
keyword: freq=noraman
keyword: PBEPBE/SDD
title: #p freq=noraman PBEPBE/SDD
converged: YES YES NO NO
title: Mulliken charges:
elementType: P O O O O O O O O O N N N N N N C C C C C C C C C C C C C H H H H H H H H H H H H H H H H H H H
charge: 1.384304 -0.263578 -0.253868 -0.434914 -0.586733 -0.276827 -0.725328 -0.682980 -0.603067 -0.203279 -0.157698 -0.438578 -0.275621 -0.046122 -0.602215 -0.618136 -0.101700 -0.138785 -0.175861 -0.165382 0.029229 -0.692050 0.447547 -0.154314 -0.039550 0.286817 0.023871 -0.453437 0.151725 0.266563 0.379557 0.257510 0.301741 0.245505 0.206450 0.255212 0.233323 0.380590 0.303264 0.351948 0.254094 0.225392 0.394948 0.435605 0.295442 0.306181 0.315026 0.358178
chargesum: 0.00000
title: Mulliken charges with hydrogens summed into heavy atoms:
elementType: P O O O O O O O O O N N N N N N C C C C C C C C C C C C C
charge: 1.384304 -0.263578 -0.253868 -0.054324 -0.586733 -0.276827 -0.330380 -0.247375 -0.603067 -0.203279 -0.157698 -0.086630 -0.275621 -0.046122 -0.000592 0.055069 0.164863 0.240772 0.081649 0.136359 0.274733 0.002935 0.447547 0.148951 -0.039550 0.286817 0.023871 0.026049 0.151725
polarizability: 2.88318524e+02 -8.82772464e-01 2.23037300e+02 -9.31383158e+00 -1.89518523e+01 1.88338082e+02
1716.lowfreq: -6.0599 -4.6840 -0.0009 0.0005 0.0012 3.5834 17.6538 26.5039 37.3180
frequency: 17.4336 26.4789 37.2842 46.2013 50.1623 61.5829 71.0621 85.7877 92.1331 101.4318 114.3113 123.3516 140.6459 148.7172 154.4606 172.5430 183.5703 198.2440 204.4107 212.7781 225.1982 243.4477 248.2338 251.5651 267.5503 283.6633 298.0096 305.5172 313.0462 324.2574 335.2990 348.4484 351.6998 374.1865 376.1030 390.2297 412.1702 439.6012 444.2664 481.8014 486.8714 498.1783 504.8843 525.7120 547.7177 552.3480 561.5302 609.3171 629.8239 636.6735 638.5645 645.4506 652.6751 664.5376 687.6408 693.2193 702.7285 750.4248 759.2498 770.5449 781.5699 815.7224 826.7633 839.7164 861.7549 875.1667 880.3523 915.3908 933.5585 964.1481 965.7425 978.4826 982.0374 1004.8954 1009.1351 1027.9939 1030.2758 1056.0199 1080.4392 1100.0229 1107.2876 1108.0097 1134.3520 1142.0613 1156.2853 1164.2986 1181.2250 1192.1746 1201.5799 1215.1982 1215.6148 1242.6794 1267.1079 1273.1485 1294.5561 1296.1835 1298.7229 1319.3087 1330.3875 1336.6841 1344.0482 1352.3141 1371.3163 1377.8624 1387.6107 1390.7743 1392.4847 1406.7035 1452.9524 1463.1625 1464.7318 1470.6880 1520.4214 1553.0132 1599.5582 1603.1718 1633.8847 1643.3549 1646.4143 1665.6600 2846.2701 2977.5338 2994.4083 3014.9753 3029.8416 3045.3320 3046.4330 3077.6108 3091.8625 3114.2854 3260.6778 3510.5531 3521.3234 3528.6150 3546.0236 3594.6064 3648.8786 3696.6456
redmass: 6.0252 5.6016 7.3374 5.9739 7.8274 6.2909 4.8313 4.3754 5.3777 6.0232 4.6144 4.2830 6.6725 6.2707 4.8007 2.0225 3.7078 4.0675 2.7899 1.2764 3.2210 2.8745 4.7780 8.2378 5.3210 1.5854 6.0598 2.8950 5.4411 4.3335 2.8420 8.7827 5.5432 3.0613 2.8086 6.3059 6.0947 5.7083 4.2714 3.6049 1.4117 1.5081 1.2887 5.6163 2.9032 1.2055 3.9739 5.4199 4.7473 5.3713 8.5722 5.8484 7.1284 4.4398 5.5205 7.6877 5.5661 3.4434 2.8558 4.9864 4.3585 6.4038 6.6972 4.9204 5.2299 4.6529 4.1811 3.5576 6.4942 2.3462 3.3250 2.0707 2.3630 1.4071 2.2401 4.1401 3.0922 3.2988 6.4100 3.8810 1.9716 1.9157 2.6235 2.2438 2.6971 1.7705 1.5476 1.8983 1.8012 1.7564 1.2904 1.2745 1.2235 1.7710 1.6080 1.3953 1.9534 1.4671 1.4705 1.5694 1.3042 2.1264 1.4318 1.6925 1.6725 2.2860 1.6103 1.4485 2.2231 1.0483 1.0933 1.0496 5.7593 3.6849 2.0904 1.5360 10.9205 1.8330 2.7363 1.3332 1.0717 1.0843 1.0374 1.0887 1.0846 1.0862 1.0859 1.0878 1.0976 1.1014 1.0997 1.0452 1.0779 1.0658 1.0458 1.0659 1.1001 1.1049
irintensity: 1.5726 0.7511 3.9145 3.2356 7.7265 4.0127 1.7914 2.5192 3.2101 3.0188 15.6973 3.8842 6.8686 12.8861 11.4752 27.8437 21.1342 14.2293 19.4155 8.6856 9.7707 11.8600 11.4335 17.1198 10.8127 48.9124 4.3241 19.7294 4.7108 44.4396 3.4169 23.8507 21.9386 101.4823 12.9732 7.6723 9.6217 17.2683 10.7371 73.4038 181.5429 49.7254 391.2804 20.2590 11.9485 130.0686 0.7387 17.8509 26.5069 27.8608 110.6587 50.7114 15.6251 5.1873 9.0384 33.4620 85.5540 6.5095 20.9331 26.7512 32.3240 14.3773 62.4940 5.6915 24.6617 136.6082 68.4609 28.0229 42.3675 60.7584 6.3680 38.1060 66.3156 88.6074 30.3945 33.9749 35.1661 19.0061 147.8063 2.2772 59.7582 34.8330 252.6731 43.0569 39.7665 110.7840 100.2460 84.7448 90.9469 54.6564 31.0686 9.7399 90.3864 76.6631 12.9121 17.9836 22.7053 24.9735 61.5958 31.0070 4.8922 33.6544 152.5663 629.7730 57.1625 138.5965 24.7048 5.7431 8.3986 9.1204 20.6461 4.0000 200.0182 180.6771 188.0545 57.0386 503.0890 17.1824 981.6652 1240.4149 74.5383 11.7779 14.2382 32.3094 17.5383 20.3847 6.0314 8.0450 22.6880 12.2556 7.4668 5.7276 41.6066 62.0315 115.5692 46.6055 14.4956 46.5747
temp: 298.150 k
press: 1.00000 atm
elementType: 15 8 8 8 8 8 8 8 8 8 7 7 7 7 7 7 6 6 6 6 6 6 6 6 6 6 6 6 6 1 1 1 1 1 1 1 1 1 1 1 1 1 1 1 1 1 1 1
symmnumber: 1
zpe: 916142.3 jmol-1
zpe.correction: 0.348940 hartree
zpe.thermalcorrener: 0.378259 hartree
zpe.thermalcorrenthalpy: 0.379203 hartree
zpe.thermalcorrgfe: 0.288553 hartree
zpe.sumelectzpe: -1851.323523 hartree
zpe.sumelectthermal: -1851.294203 hartree
zpe.sumelectthermalent: -1851.293259 hartree
zpe.sumelectthermalfe: -1851.383910 hartree
dipole: 8.6048 -8.7455 2.8538
dipole: 12.5964
quadrupole: -178.8440 -185.3912 -172.3603
quadrupole: 46.4172 -15.0763 -10.7619
quadrupole: 0.0212 -6.5261 6.5049 46.4172 -15.0763 -10.7619
hfenergy: -1851.6724627 hartree
pointgroup: C01 [X(C13H19N6O9P1)]
dipole: 0.8505035 4.726792 -1.2224078 debye
polarizability: 253.2524241|34.5547127|247.0485548|30.5167829|-5.4734769|199.3929262 unknown
InChI: InChI=1S/C13H19N6O9P/c1-4(28-29(23,24)25)8-9(26-5(20)2-14)7(21)12(27-8)19-3-16-6-10(19)17-13(15)18-11(6)22/h3-4,7-9,12,17,21,23-24H,2,14-15H2,1H3
charge 0 multiplicity 1
48 atoms
P  1.876059 -2.580177 0.262165
O  -0.324363 1.23497 -1.27017
O  2.85872 2.290482 -0.33582
O  0.474953 3.488334 0.667154
O  0.878748 -1.397447 -0.545301
O  3.056725 3.026972 1.867789
O  2.682292 -1.410974 1.312031
O  0.786888 -3.386843 1.211508
O  2.893474 -3.39062 -0.641265
O  -3.16712 -4.028766 0.66699
N  -1.214622 0.232809 0.720137
N  -3.058848 -0.171472 -0.922857
N  -1.149402 -1.846169 1.624812
N  -4.041733 -2.390269 -0.785377
N  5.176773 4.686193 1.124259
N  -4.833838 -0.831592 -2.343958
C  1.137906 0.910854 -1.334052
C  1.735463 1.374724 0.016626
C  0.560058 2.046163 0.820187
C  -0.697609 1.489343 0.121673
C  1.401693 -0.575742 -1.66581
C  0.739398 -1.041953 -2.96472
C  -2.207399 -0.532897 0.10716
C  -0.594697 -0.620097 1.636481
C  -2.195756 -1.804545 0.68152
C  3.492976 2.977936 0.689459
C  -3.133933 -2.85045 0.2266
C  4.776326 3.628182 0.205544
C  -3.976808 -1.181446 -1.318111
H  1.541941 1.529786 -2.154826
H  2.163774 0.5366 0.596486
H  0.626605 1.774754 1.888279
H  -1.495965 2.248662 0.105455
H  2.503486 -0.700761 -1.734188
H  1.082836 -0.431631 -3.820637
H  0.998094 -2.095516 -3.159636
H  -0.356943 -0.9535 -2.886811
H  1.161566 3.893904 1.259013
H  0.28916 -0.356988 2.208802
H  -2.830087 0.617111 -1.533492
H  4.600974 4.025621 -0.811186
H  5.508684 2.787572 0.086331
H  3.460723 -1.780817 1.800743
H  -0.145583 -2.859537 1.542149
H  6.051047 5.162831 0.906028
H  5.027624 4.48234 2.114275
H  -4.985033 0.130377 -2.637459
H  -5.471227 -1.559613 -2.659681
