program: Gaussian 09
title: 000196037
version: EM64L-G09RevD.01
frameworkgroup: C1[X(C20H23ClN4O6)]
method: RPBEPBE
basis: SDD
operation: Freq
keyword: #p
keyword: freq=noraman
keyword: PBEPBE/SDD
title: #p freq=noraman PBEPBE/SDD
converged: YES YES NO NO
title: Mulliken charges:
elementType: Cl O O O O O O N N N N C C C C C C C C C C C C C C C C C C C C H H H H H H H H H H H H H H H H H H H H H H H
charge: -0.077769 -0.268576 -0.455894 -0.298161 -0.315739 -0.262491 -0.204679 -0.148781 -0.148954 -0.222658 -0.094054 -0.427107 -0.050310 0.126774 0.077346 -0.332197 0.208681 -0.188100 0.205497 0.212309 0.215605 -0.609652 -0.709583 -0.716958 -0.599135 0.391265 -0.382557 -0.295107 -0.192081 -0.249001 -0.124336 0.255501 0.287763 0.240989 0.248684 0.229469 0.288667 0.251082 0.248482 0.271018 0.242379 0.239518 0.223692 0.274667 0.230740 0.232202 0.356079 0.256607 0.252702 0.263258 0.253330 0.284081 0.253263 0.252230
chargesum: 0.00000
title: Mulliken charges with hydrogens summed into heavy atoms:
elementType: Cl O O O O O O N N N N C C C C C C C C C C C C C C C C C C C C
charge: -0.077769 -0.268576 -0.099815 -0.298161 -0.315739 -0.262491 -0.204679 -0.148781 -0.148954 -0.222658 -0.094054 0.116157 0.190678 0.126774 0.077346 0.145956 0.208681 0.100567 0.205497 0.212309 0.215605 0.160931 -0.003993 0.020650 0.173432 0.391265 -0.129227 -0.011025 0.061181 0.003229 -0.124336
polarizability: 3.17474595e+02 -2.74671074e+00 3.12029303e+02 1.50529135e+01 3.77024495e+00 2.03474618e+02
1716.lowfreq: -5.1934 0.0008 0.0009 0.0015 0.8816 4.3754 12.2930 14.2160 24.9692
frequency: 12.2430 14.1512 24.9479 32.5142 41.2615 50.5115 60.8778 72.0035 75.2153 78.8807 83.9985 97.0994 101.0492 115.6946 134.7252 142.7599 149.2718 162.1838 168.8264 188.3393 205.3720 217.9442 232.5136 241.0818 271.2764 274.7056 277.8737 283.0969 293.3388 296.2448 312.5129 317.4240 340.3741 348.6685 365.9542 369.4549 372.2728 388.7836 407.0081 414.0560 419.0000 433.0996 436.5686 483.1221 499.3652 506.5007 546.1216 556.8076 577.7876 612.3626 625.3333 640.5526 648.9811 668.9598 697.0618 703.5553 708.4074 729.0048 742.6564 747.5580 768.2552 783.4817 814.7001 821.7050 825.7746 849.8933 881.9238 894.7299 914.3214 930.1601 934.7697 941.7398 949.2160 956.1457 958.2093 990.1516 1009.3431 1009.6700 1021.3794 1048.2321 1049.4616 1065.1049 1071.6426 1099.5128 1110.9140 1129.0716 1132.1727 1150.6273 1164.6841 1166.7046 1179.9654 1180.4124 1198.3004 1209.6942 1214.0928 1218.7402 1222.0245 1231.9931 1258.7678 1270.8902 1290.4130 1302.5188 1303.5748 1335.7836 1353.3136 1360.9104 1370.6266 1376.3518 1381.5046 1395.8844 1397.3057 1402.6401 1409.2570 1421.8691 1426.9724 1445.7583 1451.7319 1454.2120 1463.7920 1470.0190 1471.3445 1473.0580 1477.7039 1478.0816 1478.4436 1490.0045 1501.9003 1570.0620 1587.2833 1598.2528 1613.3078 1642.0141 1649.2746 2995.5665 3004.2824 3009.0522 3010.2229 3015.2487 3026.1876 3042.6867 3100.8023 3103.0538 3105.7980 3106.9905 3108.0086 3122.1795 3125.3404 3126.5380 3141.3685 3142.2748 3157.1356 3164.5515 3177.5900 3196.5280 3259.4276 3579.3497
redmass: 6.6813 7.3710 6.2915 6.1559 5.8361 4.6255 5.3657 5.9322 1.0647 3.9743 1.1970 5.5954 4.2985 4.4840 3.0792 4.5239 4.0582 7.4912 1.5800 3.6429 3.7184 4.5407 1.0969 3.3223 2.7457 1.7116 3.9514 3.6702 3.4618 3.9326 3.8617 5.2739 3.2237 3.0617 5.4143 5.9565 6.7717 5.4151 3.9010 3.2495 3.1055 4.4347 6.1830 5.9150 3.7302 3.6404 5.8018 4.8193 4.5180 4.5425 5.3910 6.9830 5.6523 8.3239 3.8374 10.8754 7.2332 5.0191 8.4658 5.6255 4.5279 5.4502 1.2792 1.4969 1.4822 3.0767 3.7071 2.4507 3.3064 4.2202 1.7160 1.4285 2.0801 1.4209 5.0701 3.8332 1.8683 1.8033 2.8700 3.1391 3.2242 2.1533 2.5766 3.7699 1.3116 1.3051 1.3004 1.8231 1.9664 2.3456 1.1706 3.9550 2.0279 4.0412 1.6597 2.8055 2.4778 1.8380 2.7802 2.2737 1.2724 3.1537 1.5266 1.7866 1.6175 2.0921 6.0648 1.1950 1.6462 1.6995 1.3886 2.6017 1.6605 1.3773 1.2744 1.5965 1.1270 1.0666 1.1653 1.4738 1.1292 1.2811 1.0434 1.1106 1.1326 1.0672 2.4675 8.1751 7.2324 7.0548 10.7584 9.6362 11.0923 1.0850 1.0344 1.0361 1.0334 1.0330 1.0572 1.0636 1.1026 1.1092 1.1004 1.1022 1.1005 1.1008 1.1016 1.1003 1.1016 1.1023 1.0882 1.0907 1.0973 1.0944 1.0995 1.0667
irintensity: 0.1245 0.3030 0.6275 0.8048 0.4625 0.8352 0.3308 0.2983 0.0732 1.4510 0.2400 0.4594 0.6542 5.3454 1.3531 0.3241 4.5812 4.5444 0.7023 0.7694 2.6816 2.9683 0.1485 2.5975 38.8579 69.7755 5.7763 16.4669 15.6045 4.5491 14.5930 3.1063 35.8446 4.6043 3.5470 8.9099 7.3171 10.4523 3.8068 18.9687 0.0867 12.2314 13.6331 21.0807 5.4825 8.7256 4.2126 8.2448 3.5261 10.9382 5.7189 37.4670 9.8489 0.2598 0.8178 8.2946 5.2751 6.1314 11.2659 5.1329 9.8862 0.2122 8.0000 18.0564 70.6447 9.2541 14.9919 15.2215 2.9412 34.5356 1.9001 2.0377 8.7099 5.3318 23.8989 52.6566 29.2011 27.2948 44.4683 44.1843 456.2091 39.7143 26.6933 4.5697 25.4584 0.1558 0.1898 16.6079 79.3261 120.9733 35.9063 30.3581 19.4349 130.3080 78.8997 18.1211 11.3893 18.9505 54.0201 6.6867 5.2204 17.0290 0.9001 19.7851 1.7406 19.5046 11.5054 13.3174 15.5732 28.0920 20.5583 4.3159 38.8788 52.8668 56.5510 200.5618 3.4771 9.6499 35.7700 71.1850 57.5549 19.1133 16.8798 11.5665 33.6033 59.0164 128.4157 12.8296 15.7830 26.1336 748.0346 409.7494 167.2190 15.6195 11.3168 17.3384 34.5713 21.4157 32.7611 18.7400 15.1876 8.4466 5.7307 13.6823 20.5030 20.0184 1.5646 10.1175 0.4127 0.9106 3.1336 9.7425 3.6937 17.3404 4.1170 16.8227
temp: 298.150 k
press: 1.00000 atm
elementType: 17 8 8 8 8 8 8 7 7 7 7 6 6 6 6 6 6 6 6 6 6 6 6 6 6 6 6 6 6 6 6 1 1 1 1 1 1 1 1 1 1 1 1 1 1 1 1 1 1 1 1 1 1 1
symmnumber: 1
zpe: 1084494.1 jmol-1
zpe.correction: 0.413062 hartree
zpe.thermalcorrener: 0.444366 hartree
zpe.thermalcorrenthalpy: 0.445311 hartree
zpe.thermalcorrgfe: 0.347421 hartree
zpe.sumelectzpe: -1904.071347 hartree
zpe.sumelectthermal: -1904.040043 hartree
zpe.sumelectthermalent: -1904.039099 hartree
zpe.sumelectthermalfe: -1904.136988 hartree
dipole: -2.4728 -6.8471 2.2286
dipole: 7.6134
quadrupole: -193.9695 -181.4696 -191.4455
quadrupole: 3.4371 9.7001 -6.6356
quadrupole: -5.0080 7.4920 -2.4840 3.4371 9.7001 -6.6356
hfenergy: -1904.4844094 hartree
pointgroup: C01 [X(C20H23Cl1N4O6)]
dipole: -0.673024 -1.0762296 -2.7131092 debye
polarizability: 317.6433556|10.0620029|251.7466636|-11.5513534|53.9865182|263.5884973 unknown
InChI: InChI=1S/C20H23ClN4O6/c1-20(2,31-14-7-5-12(21)6-8-14)18(28)30-10-13(26)9-25-11-22-16-15(25)17(27)24(4)19(29)23(16)3/h5-8,11,13,26H,9-10H2,1-4H3
charge 0 multiplicity 1
54 atoms
Cl -0.852481 1.91795 5.998628
O  -2.5722 -1.501597 -1.581842
O  0.227745 -3.715488 -2.747881
O  -4.198975 0.224677 1.266032
O  0.373233 0.692758 -0.100684
O  4.614273 2.665008 -0.69226
O  -2.663358 -2.086348 0.677757
N  1.764865 -1.986568 -0.918206
N  4.441178 0.358945 -1.095086
N  2.517968 1.654143 -0.403905
N  3.990551 -2.050765 -1.449906
C  0.367239 -2.420271 -0.737484
C  -0.367813 -2.541825 -2.081265
C  2.25212 -0.672714 -0.793156
C  3.616928 -0.754577 -1.120901
C  -1.882352 -2.779386 -1.903615
C  1.604471 0.550714 -0.40774
C  2.838437 -2.763494 -1.319497
C  -3.792641 0.000593 -0.136422
C  3.909961 1.617934 -0.73118
C  -2.94397 -1.290828 -0.238684
C  5.872646 0.23889 -1.438251
C  -5.148858 -0.272903 -0.833918
C  -3.092488 1.227913 -0.767446
C  2.000982 2.988316 -0.016657
C  -3.313946 0.606874 2.295675
C  -3.972802 0.951027 3.502867
C  -1.902192 0.6544 2.218851
C  -3.23137 1.346254 4.633619
C  -1.157791 1.057614 3.351548
C  -1.826216 1.397529 4.540038
H  0.355489 -3.404388 -0.237723
H  -0.136829 -1.686793 -0.09185
H  -0.2161 -1.619497 -2.678697
H  -2.08314 -3.525166 -1.114291
H  -2.327428 -3.103335 -2.859271
H  2.739723 -3.827089 -1.515891
H  6.36767 -0.463557 -0.747425
H  5.982998 -0.142331 -2.466942
H  6.321222 1.238923 -1.351497
H  -5.670428 -1.11211 -0.343573
H  -5.779637 0.62726 -0.74314
H  -4.994668 -0.50736 -1.899309
H  -2.073748 1.394885 -0.387838
H  -3.027162 1.085281 -1.858663
H  -3.70592 2.121889 -0.560265
H  0.042545 -3.686987 -3.719685
H  2.549802 3.363471 0.862198
H  2.144972 3.703056 -0.843071
H  0.932343 2.875662 0.215487
H  -5.064915 0.899678 3.539111
H  -1.34748 0.390373 1.317596
H  -3.738895 1.610237 5.565813
H  -0.066258 1.098023 3.294302
