program: Gaussian 09
title: 000195989
version: EM64L-G09RevD.01
frameworkgroup: C1[X(C20H29N3O3S)]
method: RPBEPBE
basis: SDD
operation: Freq
keyword: #p
keyword: freq=noraman
keyword: PBEPBE/SDD
title: #p freq=noraman PBEPBE/SDD
converged: NO YES NO NO
title: Mulliken charges:
elementType: S O O O N N N C C C C C C C C C C C C C C C C C C C C H H H H H H H H H H H H H H H H H H H H H H H H H H H H H
charge: 0.160859 -0.252375 -0.264397 -0.314369 -0.389201 -0.371519 -0.386034 -0.201578 -0.223621 -0.403387 -0.429180 -0.371438 -0.377347 -0.646549 -0.338454 -0.570135 0.238039 0.222746 0.282763 0.493111 -0.690962 -0.409171 -0.426003 -0.221373 -0.230348 -0.255444 -0.853874 0.232348 0.282144 0.207048 0.228822 0.215261 0.214423 0.199998 0.221862 0.266696 0.271259 0.244746 0.222185 0.250590 0.217579 0.220998 0.247951 0.329846 0.317102 0.349422 0.243336 0.275795 0.272057 0.232373 0.242726 0.225018 0.230899 0.250911 0.260710 0.255137
chargesum: 0.00000
title: Mulliken charges with hydrogens summed into heavy atoms:
elementType: S O O O N N N C C C C C C C C C C C C C C C C C C C C
charge: 0.160859 -0.252375 -0.264397 -0.314369 -0.059355 -0.054417 -0.036612 0.030770 0.058523 0.032483 0.000504 0.050422 0.160608 -0.179618 0.129716 -0.101186 0.238039 0.222746 0.282763 0.493111 -0.171830 -0.137114 -0.193631 0.021353 -0.005329 -0.024545 -0.087117
polarizability: 3.27349422e+02 1.10892211e+01 2.45261370e+02 8.99702715e+00 -1.55882769e+01 1.92173301e+02
1716.lowfreq: -6.3409 0.0011 0.0013 0.0015 3.1682 4.3050 19.7815 23.2604 29.8270
frequency: 19.4998 23.2346 29.8189 40.2694 44.5241 51.2226 52.3153 62.4733 70.3069 85.8495 89.7915 101.6873 122.4037 134.8929 154.9931 159.5388 163.1857 176.6653 195.9521 214.0601 220.9530 228.8867 236.2864 247.7736 276.7572 283.7656 292.9700 320.8669 344.4173 358.2402 374.5297 395.1722 404.0908 434.5886 461.7720 495.0309 505.7034 545.1891 554.8322 567.8968 584.1440 593.6597 603.5594 617.1841 620.2411 653.0849 664.4825 675.5350 707.7466 709.9246 726.1555 748.5370 764.4573 767.9414 787.4334 804.8474 814.6673 823.1340 852.7485 861.7551 883.4662 900.5829 915.5022 928.1609 944.0658 965.6453 972.9971 975.1476 979.4996 982.3426 989.9773 992.4760 1000.4997 1026.5585 1030.5322 1054.4057 1058.8501 1067.6668 1069.9876 1080.1859 1090.3253 1095.0301 1113.2828 1126.1740 1160.0360 1170.4724 1173.5319 1175.5213 1182.5371 1190.8722 1213.3034 1214.6891 1221.4923 1227.9371 1229.8126 1237.9738 1262.4149 1265.1817 1273.3414 1279.4452 1293.4367 1315.9752 1320.6064 1321.7187 1330.6930 1336.3443 1342.8838 1348.1451 1349.8359 1352.1805 1357.0989 1366.7529 1382.3188 1441.7169 1446.7849 1448.9932 1454.2258 1460.7070 1463.4483 1463.8259 1466.8535 1471.4878 1475.6417 1479.6288 1484.1553 1488.1578 1495.2892 1508.2074 1586.7190 1591.7267 1613.5871 1620.7060 1628.6602 2970.0747 2975.6007 2983.8078 2984.8461 2986.6311 2989.0258 2993.3051 2994.0674 2996.4538 3023.7429 3034.0935 3034.5537 3034.6272 3051.0878 3053.9752 3056.5254 3057.4520 3062.5674 3101.6024 3103.7060 3112.4224 3124.6638 3125.3741 3136.8876 3147.8332 3162.0169 3493.6704 3520.2298 3540.4950
redmass: 5.2418 5.2110 4.5925 4.6481 5.4457 5.2733 4.8585 4.2845 5.1850 2.7503 4.2104 5.4043 4.5749 4.2749 2.9002 4.1751 1.1282 4.6885 2.6009 3.7474 4.5545 4.3343 2.3514 3.6613 3.8542 3.5612 4.1313 4.0557 2.6114 3.9358 2.9184 3.3148 2.8531 3.4103 4.0707 3.5430 3.6136 2.8606 2.4980 1.5019 2.0522 2.2067 2.9953 5.8778 1.2269 3.0533 6.4331 2.9337 2.4001 2.7680 1.4834 2.7460 2.4237 3.4488 1.5462 2.5448 3.1360 2.1378 3.7701 1.2568 2.9337 2.3686 2.4873 1.4252 3.1722 1.3058 1.7990 1.3456 1.9005 1.4388 5.3510 2.2610 1.3257 2.1999 1.7697 3.0852 3.4610 2.5149 2.1804 1.8384 2.3134 2.2568 2.7936 2.6239 1.5120 1.1834 1.1473 1.3485 1.4195 1.1280 1.8814 1.9006 1.3054 1.8300 1.4328 1.5613 1.2680 1.3204 1.1577 1.3246 1.2879 1.2561 1.4497 1.3190 1.2819 1.2449 1.3682 1.4640 1.2693 1.4073 1.4527 1.3918 7.1017 2.1467 1.1230 1.0568 1.0876 1.2885 1.1673 1.0601 1.1417 1.4517 1.3312 1.1594 2.2175 1.0990 1.4206 1.4683 5.0881 5.9964 6.0977 8.0532 6.2107 1.0678 1.0600 1.0799 1.0622 1.0588 1.0610 1.0589 1.0297 1.0643 1.0996 1.0865 1.0934 1.0638 1.0990 1.0974 1.1060 1.1019 1.1010 1.1037 1.1054 1.0874 1.1019 1.0872 1.0914 1.0961 1.1014 1.0778 1.0781 1.0777
irintensity: 0.3144 1.8626 3.7440 1.2674 2.2736 1.6954 2.4519 5.4305 7.6277 1.4144 9.2931 1.7862 2.6762 1.7515 1.2600 6.9899 0.8378 1.9937 4.1053 2.8791 7.8966 0.4948 2.5046 4.8707 6.4153 0.8420 1.7290 8.2257 14.1212 3.7662 10.5506 10.8164 0.3293 8.6678 10.2163 14.6155 5.8969 49.7494 49.3752 76.7605 41.8915 31.9273 20.9082 1.8028 42.4515 11.2063 1.2954 9.6138 36.9466 12.9611 7.2272 65.5159 5.0120 17.1613 9.9045 2.7433 2.9905 4.6194 0.9856 2.8418 2.8963 6.7459 1.5364 6.1043 1.5512 4.0471 4.7518 14.2051 2.2936 0.7734 0.5353 3.3430 0.3564 7.0990 0.6043 1.7284 4.0416 1.2279 0.9317 13.1350 2.7678 5.3305 1.4691 1.2650 3.1973 4.7709 3.7444 1.1922 14.7285 1.6114 15.1735 17.8580 20.2374 32.2350 15.7101 7.2574 4.9127 42.0696 1.5241 56.6583 14.1133 0.7666 7.4916 25.2173 0.9399 11.1518 4.5883 3.3981 14.5607 0.2834 6.8574 2.8014 0.6992 7.8369 36.7445 10.8997 12.0108 22.7279 5.2750 1.6220 78.9118 127.4386 222.8376 52.7828 3.4288 7.4033 65.4495 203.8152 83.5466 2.8118 5.5329 184.1098 147.8858 39.7950 17.0261 5.6863 8.5241 36.7106 55.8593 28.6721 32.2589 36.9696 4.7985 8.1118 20.9065 7.1506 31.0415 28.6496 18.9627 10.2922 77.7858 22.6219 13.0357 8.0365 11.0191 4.0276 13.5823 25.3921 18.7290 75.9375 28.0759 24.6789
temp: 298.150 k
press: 1.00000 atm
elementType: 16 8 8 8 7 7 7 6 6 6 6 6 6 6 6 6 6 6 6 6 6 6 6 6 6 6 6 1 1 1 1 1 1 1 1 1 1 1 1 1 1 1 1 1 1 1 1 1 1 1 1 1 1 1 1 1
symmnumber: 1
zpe: 1226204.7 jmol-1
zpe.correction: 0.467037 hartree
zpe.thermalcorrener: 0.495224 hartree
zpe.thermalcorrenthalpy: 0.496168 hartree
zpe.thermalcorrgfe: 0.405647 hartree
zpe.sumelectzpe: -1565.506678 hartree
zpe.sumelectthermal: -1565.478491 hartree
zpe.sumelectthermalent: -1565.477547 hartree
zpe.sumelectthermalfe: -1565.568068 hartree
dipole: -2.4663 -6.0507 2.6945
dipole: 7.0678
quadrupole: -143.9221 -181.9360 -172.3781
quadrupole: 5.5417 14.8877 11.1686
quadrupole: 22.1567 -15.8573 -6.2994 5.5417 14.8877 11.1686
hfenergy: -1565.9737152 hartree
pointgroup: C01[X(C20H29N3O3S1)]
dipole: -0.3517016 2.59977 -0.9218304 debye
polarizability: 317.2218545|-28.5420675|256.7145745|-13.6039953|-9.5089311|190.8476637 unknown
InChI: InChI=1S/C20H29N3O3S/c1-27-13-11-16-19(25)21-12-7-3-6-10-18(24)22-17(20(26)23-16)14-15-8-4-2-5-9-15/h2,4-5,8-9,16-17,21-23H,3,6-7,10-14H2,1H3
charge 0 multiplicity 1
56 atoms
S  3.280074 -3.80172 0.059861
O  -0.04662 -0.411635 1.582046
O  -2.184633 -3.588174 0.29069
O  -2.132443 1.746877 -1.516375
N  -0.222659 -0.645257 -0.742207
N  -1.201632 2.233252 0.546646
N  -2.836149 -1.421566 -0.265463
C  -0.505893 -2.10018 -0.76355
C  0.099899 1.619815 0.199753
C  -4.954629 0.757007 -0.701454
C  -4.758959 -0.111806 0.572649
C  -4.858827 2.291842 -0.502689
C  0.60167 -2.95211 -0.095256
C  1.233768 2.197928 1.082859
C  -4.213401 -1.522421 0.252965
C  -3.575023 2.807467 0.202228
C  -0.039641 0.084768 0.4145
C  -1.916327 -2.439054 -0.171514
C  -2.266365 2.219418 -0.336834
C  2.609011 1.731754 0.619469
C  1.924691 -2.855977 -0.869728
C  3.149736 0.50117 1.074581
C  3.359342 2.506041 -0.303282
C  4.408469 0.052884 0.614686
C  4.620611 2.062702 -0.762006
C  5.148523 0.832453 -0.304666
C  4.667293 -3.566831 -1.190474
H  -0.554975 -2.381282 -1.836309
H  0.292097 1.844053 -0.864691
H  -5.942215 0.525542 -1.146306
H  -4.207124 0.480653 -1.467052
H  -4.050465 0.368644 1.275332
H  -5.717864 -0.212864 1.115833
H  -5.7244 2.657058 0.085498
H  -4.9289 2.765103 -1.499827
H  0.236882 -3.993345 -0.060855
H  0.730611 -2.615103 0.946883
H  1.05098 1.871645 2.124653
H  1.168352 3.301545 1.043776
H  -4.189683 -2.162268 1.15332
H  -4.865631 -2.030159 -0.487142
H  -3.630446 2.6227 1.292907
H  -3.529759 3.908768 0.080722
H  -0.290495 -0.116259 -1.615975
H  -1.356497 2.489577 1.524404
H  -2.540048 -0.530159 -0.673873
H  1.834288 -3.305882 -1.876646
H  2.260495 -1.80798 -0.966311
H  2.580483 -0.10818 1.78581
H  2.95854 3.465044 -0.656486
H  4.80056 -0.904982 0.974746
H  5.191428 2.676279 -1.46834
H  6.129114 0.490422 -0.655061
H  5.564003 -4.045989 -0.766861
H  4.859781 -2.492751 -1.349604
H  4.408802 -4.051678 -2.146078
