program: Gaussian 09
title: 000196052
version: EM64L-G09RevD.01
frameworkgroup: C1[X(C23H26N2O4S3)]
method: RPBEPBE
basis: SDD
operation: Freq
keyword: #p
keyword: freq=noraman
keyword: PBEPBE/SDD
title: #p freq=noraman PBEPBE/SDD
converged: YES YES NO NO
title: Mulliken charges:
elementType: S S S O O O O N N C C C C C C C C C C C C C C C C C C C C C C C H H H H H H H H H H H H H H H H H H H H H H H H H H
charge: 1.037203 0.235950 0.079400 -0.570707 -0.514000 -0.512081 -0.245697 -0.162652 -0.089074 -0.451796 -0.375653 -0.311494 0.251902 -0.619057 0.223344 -0.240944 0.368670 -0.350659 -0.338766 -0.372508 -0.258899 -0.269101 -0.338522 -0.337139 -0.346723 -0.182893 0.286164 -0.271698 -0.519592 -0.239795 -0.683387 -0.183103 0.244411 0.234057 0.231395 0.245116 0.241549 0.236012 0.297717 0.296432 0.238729 0.224174 0.238896 0.229465 0.236576 0.238709 0.208022 0.238033 0.239876 0.226935 0.222954 0.211673 0.384480 0.215771 0.213914 0.221593 0.228023 0.258794
chargesum: 0.00000
title: Mulliken charges with hydrogens summed into heavy atoms:
elementType: S S S O O O O N N C C C C C C C C C C C C C C C C C C C C C C C
charge: 1.037203 0.235950 0.079400 -0.186227 -0.514000 -0.512081 -0.245697 -0.162652 -0.089074 0.026672 0.100858 0.166067 0.251902 -0.024908 0.223344 -0.002215 0.368670 -0.126485 -0.099870 -0.143043 -0.022322 -0.030392 -0.130501 0.140770 0.103166 0.028780 0.286164 -0.271698 -0.519592 -0.011772 -0.032109 0.075691
polarizability: 1.31037086e+03 -5.91566856e+01 3.65091743e+02 7.35455366e+01 2.54360969e+01 2.04869874e+02
1716.lowfreq: -6.2706 -2.0102 -0.0011 -0.0004 0.0019 2.0990 5.5518 9.0983 12.8812
frequency: -4.4305 7.5453 12.8349 19.9713 23.9593 27.3819 41.3825 43.3067 55.2506 68.5245 72.8545 86.0745 90.5204 95.5740 99.8101 115.0016 135.2908 143.1341 147.4432 158.6850 177.4899 181.3298 203.1550 221.5526 221.9892 227.9684 241.8211 253.5521 258.1917 285.1220 296.0480 299.0726 311.2118 322.4947 339.6036 345.3465 353.9902 356.9040 386.8478 397.4835 413.2305 420.8930 430.3666 452.5828 492.0809 504.0473 509.8975 515.6155 526.7155 532.5222 540.8902 558.2961 575.5529 603.2865 618.9484 644.9629 654.0268 701.3717 713.3805 718.3057 752.0916 753.4897 759.4090 764.0213 786.8240 793.3208 799.3051 806.6977 843.3843 852.6822 859.6713 868.5744 871.0730 880.4837 892.2081 909.8526 919.7741 934.9157 946.1206 954.3201 959.4953 979.1740 986.5481 988.2969 1011.8774 1025.2515 1040.2296 1046.8654 1052.1903 1058.1020 1079.3026 1086.0765 1107.1705 1112.8310 1131.1142 1137.0690 1160.2385 1186.0340 1194.2414 1202.6952 1218.7666 1227.2534 1237.1646 1240.9115 1244.2162 1248.6283 1261.0762 1271.6866 1282.3255 1294.7628 1295.4996 1299.3875 1301.0443 1308.5766 1317.3825 1333.5208 1335.4859 1348.1628 1353.2580 1366.3616 1378.8162 1381.3160 1391.0407 1391.2231 1416.3554 1433.6360 1444.6357 1469.2228 1474.8623 1476.1868 1478.8198 1485.1081 1485.5038 1488.7506 1502.8642 1514.9829 1558.6972 1563.4471 1605.2415 1605.3051 1614.1248 1641.9904 2977.3761 2987.4971 2997.0627 2997.7420 3014.8833 3017.0276 3037.1496 3046.6288 3056.7719 3059.1533 3073.7233 3077.3796 3080.7182 3086.5262 3091.8914 3095.8170 3103.0812 3128.3370 3141.1843 3151.0682 3156.4645 3162.9130 3170.7455 3180.2626 3191.5386 3499.8402
redmass: 9.0498 9.3597 8.5311 5.0978 5.7690 6.6183 4.6313 4.5094 5.5298 7.8909 6.7110 3.4381 2.0774 4.3812 2.6413 4.7409 5.0590 2.8663 5.0752 4.5515 5.7702 1.7964 4.9552 1.9198 1.4629 3.0475 1.9247 4.9124 4.9064 3.2979 6.4098 4.4961 4.3864 3.5216 3.3672 6.0002 5.4834 5.5665 6.8468 7.7947 3.5199 5.0533 4.7737 3.5511 3.9788 5.7600 4.4192 8.5629 10.3635 4.2752 4.6079 8.4075 6.9126 5.1973 5.7890 3.3401 4.8480 3.4449 4.5690 7.0934 2.2364 1.3776 1.0842 1.4645 2.3186 1.7632 1.5148 3.9141 12.0496 1.6158 1.4391 1.5663 2.1371 1.8332 1.5445 1.5039 3.2998 1.3048 1.3831 3.7113 3.7418 1.1438 1.7106 2.0937 4.1586 1.7251 3.5303 2.5356 3.0591 2.1174 2.8119 1.5084 5.0305 2.2310 2.1271 1.7673 1.6134 1.0972 2.0374 1.8051 2.6747 1.7664 1.5697 1.4134 1.6405 1.5508 1.6346 1.6852 1.5650 1.2581 1.2466 1.0687 1.4919 1.3748 1.4576 1.6364 2.2264 1.6721 1.3350 1.4040 1.9198 5.1718 1.2300 1.8819 1.1074 1.9255 1.1509 2.6952 1.0617 1.0855 1.0420 1.1298 1.0722 2.8892 1.1664 4.1267 4.6275 5.7322 6.8595 6.5084 6.3515 6.7386 1.0357 1.0595 1.0593 1.0597 1.0598 1.0582 1.1014 1.1013 1.1036 1.0565 1.1021 1.1056 1.0990 1.0919 1.1060 1.0897 1.0868 1.0877 1.0858 1.1110 1.0896 1.0882 1.0930 1.0991 1.0965 1.0665
irintensity: 0.0607 0.4228 0.7910 0.4235 1.9132 0.8445 0.2728 0.4309 0.4401 2.6005 0.7498 0.2961 0.2849 0.7055 0.3232 0.3976 0.6471 0.5087 3.7673 3.7765 5.1375 34.8026 3.7108 0.6458 0.7577 1.6727 43.1399 39.5831 1.6722 4.0138 10.0688 61.3517 2.4661 17.0905 5.9428 28.9120 8.8063 19.1303 36.0201 13.5397 4.5447 8.6650 12.0159 3.2980 6.0105 39.5102 8.3598 85.0130 2.6042 20.6521 73.9842 139.4184 74.6479 6.8615 18.4412 0.9587 10.5391 15.7375 6.1246 11.2676 18.3857 7.1102 9.8279 81.5404 1.9719 5.5861 28.1633 1.0842 76.5992 2.0299 0.0248 9.6731 44.6605 3.3387 5.8918 5.5996 19.6728 1.7877 0.1582 82.3042 9.5964 79.7893 8.5637 9.0650 22.1900 28.5010 14.2701 15.7761 0.6404 6.6274 22.8412 27.0937 166.9199 14.4381 720.0684 92.0305 102.4044 1.4351 315.0179 182.4091 278.9267 415.3336 21.1997 23.9544 19.1855 5.9496 29.6920 197.5766 110.6133 23.6889 40.2871 2.5054 21.3495 42.2192 141.4738 59.5674 83.3642 94.6784 31.1389 29.9851 98.1313 50.6773 38.6044 167.9489 7.4329 16.3588 90.8113 116.4336 1.3897 15.1004 8.6849 13.8607 14.9138 58.2203 33.9002 449.8159 1815.8329 7.9838 151.4421 102.9007 50.4203 364.4671 59.1066 1.3409 7.2782 6.5800 82.4505 45.3114 0.3592 0.0660 2.8747 2.6175 25.5783 27.9813 43.5227 1.2390 17.2614 2.4747 13.3505 20.9083 0.7212 0.3187 7.3441 1.2109 25.4532 28.3723 8.7833 87.0025
temp: 298.150 k
press: 1.00000 atm
elementType: 16 16 16 8 8 8 8 7 7 6 6 6 6 6 6 6 6 6 6 6 6 6 6 6 6 6 6 6 6 6 6 6 1 1 1 1 1 1 1 1 1 1 1 1 1 1 1 1 1 1 1 1 1 1 1 1 1 1
symmnumber: 1
zpe: 1171838.5 jmol-1
zpe.correction: 0.446330 hartree
zpe.thermalcorrener: 0.479174 hartree
zpe.thermalcorrenthalpy: 0.480118 hartree
zpe.thermalcorrgfe: 0.376161 hartree
zpe.sumelectzpe: -2494.116433 hartree
zpe.sumelectthermal: -2494.083589 hartree
zpe.sumelectthermalent: -2494.082645 hartree
zpe.sumelectthermalfe: -2494.186602 hartree
dipole: -9.1476 0.4764 -0.4536
dipole: 9.1713
quadrupole: -283.7011 -211.1731 -217.1062
quadrupole: -16.8934 -20.9166 -2.9688
quadrupole: -46.3743 26.1536 20.2206 -16.8934 -20.9166 -2.9688
hfenergy: -2494.5627631 hartree
pointgroup: C01 [X(C23H26N2O4S3)]
dipole: -3.6034907 -0.0614736 0.1747264 debye
polarizability: 1313.5010424|26.5100367|360.7731104|-71.2726165|31.455996|206.0583278 unknown
InChI: InChI=1S/C23H26N2O4S3/c1-2-14-25-22(26)21(31-23(25)30)12-6-3-9-18-13-16-24(15-7-8-17-32(27,28)29)20-11-5-4-10-19(18)20/h3-6,9-13,16,27H,2,7-8,14-15,17H2,1H3
charge 0 multiplicity 1
58 atoms
S  -9.579378 1.854285 -0.617705
S  6.236604 -1.443555 -0.800419
S  9.284405 -1.58908 -1.36257
O  -9.921488 2.436788 -2.355047
O  -9.616827 3.102388 0.411567
O  -10.449566 0.529229 -0.290898
O  6.437992 2.383039 0.198296
N  -3.413547 -0.185741 1.011856
N  7.860338 0.627402 -0.52324
C  -4.810674 0.23343 1.25663
C  -5.568794 0.594436 -0.046323
C  -7.033653 0.993883 0.260898
C  -3.090127 -1.499111 0.587502
C  -7.757152 1.384059 -1.027579
C  -1.716755 -1.838359 0.301126
C  -2.401637 0.764329 1.130763
C  -0.643554 -0.824598 0.429224
C  -1.081128 0.486513 0.862841
C  -4.110934 -2.482004 0.449318
C  -1.446995 -3.176573 -0.106621
C  -3.799743 -3.790652 0.045808
C  -2.457243 -4.142585 -0.234492
C  0.708024 -1.111307 0.149556
C  9.060702 1.494414 -0.475695
C  9.792991 1.409684 0.882172
C  1.798001 -0.19899 0.235497
C  6.580644 1.174675 -0.152711
C  5.534789 0.151171 -0.255218
C  7.923218 -0.707901 -0.88938
C  3.123521 -0.534579 -0.059394
C  11.04404 2.312835 0.890729
C  4.199713 0.397016 0.024633
H  -5.346387 -0.560069 1.808052
H  -4.785518 1.115062 1.921888
H  -5.042295 1.42827 -0.54946
H  -5.547962 -0.266053 -0.741195
H  -7.053404 1.843897 0.970105
H  -7.55838 0.146639 0.74452
H  -7.368525 2.295364 -1.507851
H  -7.872163 0.565921 -1.755438
H  -2.722694 1.755047 1.463008
H  -0.359301 1.2944 0.994506
H  -5.153913 -2.233029 0.659762
H  -0.417431 -3.468204 -0.328596
H  -4.59935 -4.532425 -0.050473
H  -2.20637 -5.16009 -0.549936
H  0.973255 -2.125591 -0.17028
H  9.732197 1.178616 -1.293637
H  8.708092 2.525436 -0.65553
H  10.08251 0.358991 1.07026
H  9.097844 1.715709 1.686197
H  1.608578 0.838252 0.547528
H  -10.880784 2.71318 -2.411881
H  11.763134 2.005273 0.108639
H  10.775479 3.370696 0.710698
H  11.562079 2.257666 1.864708
H  3.346396 -1.564861 -0.374516
H  3.978222 1.428265 0.338599
