program: Gaussian 09
title: 000195940
version: EM64L-G09RevD.01
frameworkgroup: C1[X(C7H15NO2S)]
method: RPBEPBE
basis: SDD
operation: Freq
keyword: #p
keyword: freq=noraman
keyword: PBEPBE/SDD
title: #p freq=noraman PBEPBE/SDD
converged: NO YES NO NO
title: Mulliken charges:
elementType: S O O N C C C C C C C H H H H H H H H H H H H H H H
charge: -0.226081 -0.299418 -0.349568 -0.091831 -0.311720 -0.579897 -0.575309 -0.587741 -0.574426 -0.520880 0.209797 0.281716 0.263323 0.256995 0.274031 0.237019 0.261484 0.228812 0.324596 0.252994 0.272065 0.256016 0.244447 0.191388 0.279604 0.282585
chargesum: 0.00000
title: Mulliken charges with hydrogens summed into heavy atoms:
elementType: S O O N C C C C C C C
charge: -0.226081 -0.299418 -0.066984 -0.091831 0.233320 -0.322902 0.197225 0.218661 0.198102 -0.049888 0.209797
polarizability: 1.28802411e+02 -1.45546759e+01 1.15085284e+02 -4.24033366e+00 1.89478723e+00 8.69920988e+01
1716.lowfreq: -13.4307 -9.4316 -0.0026 -0.0017 0.0022 6.9395 64.0442 74.7915 119.2282
frequency: 64.0335 74.7749 119.2182 149.3543 162.5362 208.1859 230.2728 260.3888 269.0656 277.2969 289.8610 324.1782 340.4859 392.5833 423.3934 432.8380 483.7990 490.9918 553.6749 561.1564 661.7183 694.3529 775.3574 822.5371 871.8008 911.4331 932.2740 946.1468 963.5202 1003.9001 1041.8823 1074.7669 1097.6464 1103.4364 1151.3747 1166.2741 1188.0446 1212.2901 1228.0115 1231.9305 1262.4694 1297.7794 1306.2066 1354.0236 1393.0303 1417.6788 1422.9568 1425.2594 1436.1212 1452.7945 1458.3669 1464.8654 1467.2518 1481.3984 1486.1742 1496.6195 1616.8572 2141.5631 2978.2330 3003.3102 3010.0220 3015.6487 3027.3265 3033.3798 3048.0185 3114.9543 3119.4046 3121.6979 3124.9564 3129.2295 3135.7701 3148.6870
redmass: 3.9318 5.0604 7.7058 2.5461 3.5975 1.0826 4.9067 2.4907 1.2208 1.3536 3.0167 3.8663 2.7835 2.5571 2.7785 2.2335 2.7420 2.8783 4.3321 4.7757 4.7009 4.7831 3.8720 4.6795 2.4569 2.0984 1.0810 2.5769 2.4176 1.9164 1.2011 1.5471 1.2740 1.2849 1.8143 1.1828 1.5962 1.4929 1.9050 2.3964 1.7893 1.4056 1.3352 1.3382 1.2749 1.1266 1.1150 1.1378 1.0938 1.0606 1.1181 1.0440 1.0649 1.0503 1.0515 1.0580 5.5291 1.0911 1.0625 1.0333 1.0327 1.0345 1.0840 1.0589 1.0978 1.1057 1.1045 1.1073 1.1057 1.1037 1.1041 1.1037
irintensity: 0.0707 2.0661 15.1385 1.7287 7.1259 0.3344 4.7631 8.5750 2.5115 5.0369 12.4135 7.4419 1.4121 3.1549 32.9586 19.2507 1.8222 2.2825 114.2214 84.4059 5.3267 3.6694 54.8668 8.5792 4.3208 0.6978 122.9742 9.6723 16.0689 3.1085 2.0369 20.8027 1.5142 18.5106 0.5175 1.6428 32.9816 1.1161 2.6202 28.3448 2.6461 8.4382 2.1614 3.2155 176.0087 14.8657 4.0079 18.5899 18.4882 7.0335 0.6200 5.4105 13.3604 28.7398 26.6885 96.2235 483.3198 1128.5545 40.6626 31.2873 16.4498 23.8681 43.1278 13.0967 10.6093 8.6254 1.2612 4.6060 14.0658 17.4705 13.2028 3.8639
temp: 298.150 k
press: 1.00000 atm
elementType: 16 8 8 7 6 6 6 6 6 6 6 1 1 1 1 1 1 1 1 1 1 1 1 1 1 1
symmnumber: 1
zpe: 571688.4 jmol-1
zpe.correction: 0.217745 hartree
zpe.thermalcorrener: 0.230509 hartree
zpe.thermalcorrenthalpy: 0.231454 hartree
zpe.thermalcorrgfe: 0.179382 hartree
zpe.sumelectzpe: -878.049279 hartree
zpe.sumelectthermal: -878.036514 hartree
zpe.sumelectthermalent: -878.035570 hartree
zpe.sumelectthermalfe: -878.087642 hartree
dipole: -12.7742 -0.8343 1.8407
dipole: 12.9330
quadrupole: -69.4264 -96.6392 -72.1888
quadrupole: 1.8724 5.3751 1.5933
quadrupole: 9.9917 -17.2211 7.2293 1.8724 5.3751 1.5933
hfenergy: -878.2670236 hartree
pointgroup: C01 [X(C7H15N1O2S1)]
dipole: -4.8380837 -1.3330585 -0.840312 debye
dipolederiv: -0.7319427 0.0145893 0.0447588 -0.0084489 -0.7346639 -0.0327202 0.0899319 0.0566898 -0.4290545 -0.5172478 0.0027621 -0.03003 0.1198267 -1.1576006 -0.2325141 -0.0439086 -0.1017669 -0.4816989 -0.6314313 -0.0205617 -0.2129087 0.3778019 -1.1188125 -0.2108146 -0.095783 -0.4531438 -0.7280885 -0.7529726 -0.4236334 -0.0413905 -0.52318 -0.7127658 -0.0241575 -0.152821 -0.112436 -0.2868142 0.8449496 0.6906554 0.1250576 0.8331076 0.7257025 0.0929265 0.2382136 0.17364 0.0199428 0.1580687 -0.0216699 0.0038488 -0.0622061 0.0875397 0.0103992 -0.1046938 -0.0066367 0.1242867 0.1098883 0.0174799 0.099504 -0.0445911 0.0750317 -0.041707 0.1518352 0.0010605 0.2160026 -0.0452786 -0.1197768 0.0558974 -0.0394578 0.3032243 0.0320091 0.0421595 0.008356 0.0319661 0.2068084 0.0299945 -0.094575 -0.0252763 0.068152 0.0036741 -0.1909015 -0.0574522 0.1611883 -0.0535366 0.1089899 -0.054329 0.1799287 -0.1623365 0.1160488 -0.0176776 0.0872642 -0.057864 0.3831115 0.0636956 0.3829878 -0.1294394 1.4472735 0.3060156 0.3555127 0.3810549 0.798774 0.0849225 0.0064402 -0.0549945 -0.0314419 -0.0211124 0.0622248 -0.0188708 0.0564978 0.0353678 -0.084782 0.0177341 0.0494474 0.070047 0.0417316 -0.0413489 0.0362675 -0.0259295 0.0535 -0.0798996 0.0741369 -0.0987609 0.0584128 0.0285466 0.028805 -0.0671687 0.0246608 -0.0795811 0.0528005 0.0302569 0.1112314 0.030059 0.1026414 0.0085185 0.0651427 0.0171726 0.0321557 -0.0344263 -0.0983551 -0.07238 -0.1391751 -0.0013508 -0.0451326 -0.0311573 0.0000362 0.0794918 0.1045759 0.0500116 -0.0104174 0.0827042 -0.0348999 0.0017933 0.0203881 -0.0411484 0.0707928 -0.0453316 -0.1209541 -0.0714212 -0.0659658 -0.0226609 -0.0334039 -0.0653909 -0.0629632 0.0859528 0.2516352 0.0837318 0.0417367 -0.0016281 0.0920079 0.0329828 0.0328668 0.0071833 0.0629021 0.1181143 0.0287692 -0.0290582 0.0250186 0.0793718 -0.0173062 -0.0329806 0.048884 -0.0535986 0.0653937 0.0322758 -0.0930487 0.0156727 0.1085175 0.0299631 -0.0260643 0.0285006 -0.0204063 0.0637139 0.0382339 0.0233878 0.1044142 -0.0387747 0.0015191 0.0010456 0.0357945 0.0963708 -0.0214716 -0.0994728 0.0112156 -0.129549 -0.0155818 -0.0320835 -0.0240007 -0.0603263 0.0665546 0.0020409 -0.0266419 -0.1121858 -0.0398959 -0.0524217 -0.1608396 -0.10512 -0.1066453 -0.0621663 0.0090036 -0.0412852 0.0508666 -0.0662568 0.0516706 0.0878183 0.0072308 0.0251114 0.0616142 0.5432939 -0.3174061 -0.02444 -0.5904813 0.8615704 0.05733 -0.0640556 0.0765414 0.2024091 unknown
polarizability: 117.5573811|14.6812176|123.2851376|5.4568241|11.243295|90.0372756 unknown
InChI: InChI=1S/C7H15NO2S/c1-8(2,3)5-6(11)4-7(9)10/h6,9H,4-5H2,1-3H3
charge 0 multiplicity 1
26 atoms
S  1.0607 2.649792 0.73887
O  1.975441 -1.704973 -0.503071
O  2.539263 0.088693 0.82823
N  -1.833226 -0.407016 0.07116
C  -0.770018 0.721659 0.616106
C  0.156171 1.415633 -0.389532
C  -2.385934 0.005276 -1.276855
C  -1.177779 -1.778494 -0.024495
C  -2.96396 -0.47371 1.082553
C  1.156819 0.513547 -1.160977
C  1.93733 -0.464846 -0.261646
H  -0.189279 0.19092 1.390989
H  -1.414855 1.480163 1.090444
H  -0.42415 2.007006 -1.119715
H  -1.57641 -0.016468 -2.019387
H  -3.18392 -0.696275 -1.5737
H  -2.790246 1.026711 -1.205355
H  -1.90535 -2.493171 -0.445694
H  -0.268832 -1.740806 -0.643624
H  -0.881761 -2.097618 0.986887
H  -2.536372 -0.652534 2.081119
H  -3.507814 0.483599 1.084885
H  -3.65053 -1.295256 0.817934
H  0.673728 -0.085745 -1.957772
H  1.871486 1.200564 -1.651335
H  2.227097 1.120549 0.938379
