program: Gaussian 09
title: 000195939
version: EM64L-G09RevD.01
frameworkgroup: C1[X(C7H9N5)]
method: RPBEPBE
basis: SDD
operation: Freq
keyword: #p
keyword: freq=noraman
keyword: PBEPBE/SDD
title: #p freq=noraman PBEPBE/SDD
converged: NO YES NO NO
title: Mulliken charges:
elementType: N N N N N C C C C C C C H H H H H H H H H
charge: -0.170317 -0.083461 -0.054299 -0.069402 -0.618598 0.143154 -0.113732 0.156197 -0.231684 -0.634714 0.029879 -0.751403 0.261387 0.278897 0.239501 0.239495 0.235053 0.239757 0.235038 0.327657 0.341596
chargesum: 0.00000
title: Mulliken charges with hydrogens summed into heavy atoms:
elementType: N N N N N C C C C C C C
charge: -0.170317 -0.083461 -0.054299 -0.069402 0.050655 0.143154 -0.113732 0.156197 0.029703 0.123179 0.029879 -0.041556
polarizability: 1.49727335e+02 -9.87081359e-01 1.26654102e+02 1.47311914e-03 -2.78765385e-03 5.46088589e+01
1716.lowfreq: -9.4956 -2.9428 0.0007 0.0007 0.0008 7.6560 68.3626 81.9649 105.9761
frequency: 68.3280 81.9510 105.9708 144.9952 197.2832 215.6857 255.7793 268.0397 340.4604 352.5802 478.7636 502.8901 513.8253 547.6929 587.0959 607.2691 622.1794 653.2905 666.8859 711.3642 791.7009 802.0068 819.1091 904.5207 992.5117 1017.5153 1048.9236 1053.1295 1086.4604 1125.5641 1188.2297 1241.6591 1258.6010 1306.3196 1319.6013 1364.3190 1379.7213 1404.0126 1415.0622 1432.1114 1457.4770 1467.8952 1476.6946 1482.3081 1491.5034 1554.7956 1579.0292 1630.1838 2995.5591 2995.9713 3077.3710 3086.9804 3112.5762 3127.2618 3226.1170 3538.9460 3695.5116
redmass: 1.0407 1.0796 3.2814 3.6874 3.0471 5.3885 4.8465 2.7508 3.0379 5.7876 6.5549 1.2222 5.5542 1.0757 4.3088 4.2866 3.5755 4.7206 9.9674 6.9180 2.9063 8.8528 2.1360 3.2653 2.1780 3.3007 1.5819 2.1188 2.1279 1.3113 1.8748 3.5157 3.2326 5.7409 5.6192 4.7183 1.7391 3.0139 2.1790 2.0120 1.0469 1.1851 1.3555 1.0430 1.9959 5.2075 2.0691 2.6691 1.0361 1.0343 1.0970 1.1028 1.1011 1.1000 1.0982 1.0440 1.1057
irintensity: 0.0727 0.5325 6.0190 8.0422 8.9188 2.7872 0.0018 6.4850 3.4313 0.0545 4.4732 276.4998 2.1464 0.0041 0.7186 0.9788 27.7756 12.7768 4.6399 20.4302 21.1262 1.7405 5.1505 5.0832 3.7279 15.3264 6.2081 19.9061 0.1026 0.4994 17.6656 4.6832 61.4149 4.8871 83.8667 83.6386 11.1680 61.8832 43.3120 28.6095 13.9257 19.8956 37.5444 16.6128 33.4205 96.9790 42.9239 545.6668 37.9913 37.7537 15.5509 22.8862 1.8691 13.0417 0.3305 105.6680 46.7802
temp: 298.150 k
press: 1.00000 atm
elementType: 7 7 7 7 7 6 6 6 6 6 6 6 1 1 1 1 1 1 1 1 1
symmnumber: 1
zpe: 429875.6 jmol-1
zpe.correction: 0.163731 hartree
zpe.thermalcorrener: 0.174592 hartree
zpe.thermalcorrenthalpy: 0.175536 hartree
zpe.thermalcorrgfe: 0.127045 hartree
zpe.sumelectzpe: -545.055640 hartree
zpe.sumelectthermal: -545.044779 hartree
zpe.sumelectthermalent: -545.043835 hartree
zpe.sumelectthermalfe: -545.092326 hartree
dipole: 2.0044 0.0913 0.0018
dipole: 2.0065
quadrupole: -57.5622 -65.1243 -72.1378
quadrupole: -8.8936 0.0077 -0.0010
quadrupole: 7.3792 -0.1829 -7.1963 -8.8936 0.0077 -0.0010
hfenergy: -545.2193713 hartree
pointgroup: C01 [X(C7H9N5)]
dipole: -0.7889551 -0.0072524 -0.0263226 debye
dipolederiv: -0.5331771 0.025158 -0.0130963 -0.3355675 -0.5921696 -0.0047201 -0.0081758 0.0073944 -0.1389629 -0.4460017 -0.0892181 -0.0047452 -0.0878011 -0.5166004 0.0009082 -0.0051966 0.0003102 -0.2569194 -1.0188775 0.0645788 -0.0273116 0.0505242 -0.6034879 0.0074063 -0.0269604 0.007683 -0.2112608 -0.4964091 0.2737622 -0.0118661 -0.0661904 -1.2092738 0.0115396 -0.0072793 0.0225866 -0.2480122 -0.3369055 -0.3722327 0.0166703 -0.5271359 -1.4090236 -0.006906 0.0188865 -0.0019399 -0.6926189 0.8351817 0.0038709 0.023705 0.0494155 0.2960815 -0.0012538 0.0233648 -0.0022989 0.1091143 -0.2160573 -0.4386655 -0.0011551 -0.2737452 -0.3961748 -0.0031372 -0.0030521 -0.0084891 0.0047478 0.6876046 0.3833068 0.0099294 0.5532444 1.7663757 -0.0038536 0.0076611 -0.0093339 0.2136729 -0.0003988 -0.0625806 0.0035447 0.1885448 0.6581583 -0.0041919 -0.0006854 -0.0123437 -0.0747888 0.2814784 0.1995222 -0.0015593 0.3637783 0.3274819 0.0107146 -0.0039866 0.0053482 0.2405762 0.9821831 -0.1532121 0.0336083 -0.0416653 0.953818 -0.0148722 0.0320027 -0.0185013 0.0124651 -0.2298082 0.2338947 -0.0119437 0.1227144 -0.0562004 0.0052456 -0.0100488 0.0086797 0.0323401 -0.0250246 0.0092536 -0.0068862 -0.0159128 0.103984 0.0004802 -0.0059949 0.001332 0.1774982 0.1008645 0.1255821 -0.0026893 0.014836 0.0208735 0.0020048 -0.0010674 0.0056877 0.1261259 -0.0338568 -0.0851084 0.0966686 -0.0448587 0.0515984 -0.0302935 0.1371833 0.0324998 -0.0422299 -0.01849 -0.0853607 -0.0925892 -0.0505882 0.0513642 0.0242603 -0.1342081 -0.0410536 -0.0572927 0.0247995 0.0166071 -0.0943927 0.0159311 0.0674222 -0.0455343 -0.1275271 0.0022719 -0.0410768 0.0705412 -0.1161809 0.0003285 -0.0138672 -0.0897641 0.0027981 -0.001317 -0.0004439 0.1173012 0.0103756 0.0198439 0.0971981 0.0172104 0.0687427 0.0433215 0.1303426 -0.0042777 -0.0281573 0.2103219 0.0621864 -0.0062936 0.0406074 0.2206923 0.0034869 -0.0060118 0.0041494 0.3782294 0.151656 -0.0150077 -0.0071247 0.0405259 0.2861018 0.0025967 -0.0079296 0.0007391 0.3792485 unknown
polarizability: 149.4516986|2.2727473|126.8165317|3.0619403|-0.9443223|54.7220658 unknown
InChI: InChI=1S/C7H9N5/c1-4-10-6(8)5-7(11-4)12(2)3-9-5/h3H,8H2,1-2H3
charge 0 multiplicity 1
21 atoms
N  -1.962596 -0.562118 -0.059866
N  -1.476936 1.686514 -0.074937
N  0.344341 -1.474223 0.028814
N  2.036179 0.303606 0.057739
N  1.494364 2.602159 0.007981
C  -0.566879 -0.46192 -0.015099
C  -0.290073 0.930401 -0.02619
C  1.088512 1.292958 0.013089
C  -2.449623 0.754577 -0.095067
C  -2.725166 -1.815628 -0.067298
C  1.63647 -1.015469 0.063769
C  2.740617 -2.044031 0.114516
H  -3.515857 0.970335 -0.133425
H  -1.999881 -2.644332 -0.031316
H  -3.388565 -1.87885 0.812449
H  -3.32862 -1.904648 -0.987069
H  3.3570 -1.899335 1.019783
H  2.312429 -3.057472 0.11663
H  3.413185 -1.927057 -0.754064
H  2.490478 2.809225 0.037255
H  0.800922 3.346306 -0.024596
