program: Gaussian 09
title: 000195942
version: EM64L-G09RevD.01
frameworkgroup: C1[X(C9H17NO3S)]
method: RPBEPBE
basis: SDD
operation: Freq
keyword: #p
keyword: freq=noraman
keyword: PBEPBE/SDD
title: #p freq=noraman PBEPBE/SDD
converged: NO YES NO NO
title: Mulliken charges:
elementType: S O O O N C C C C C C C C C H H H H H H H H H H H H H H H H H
charge: 0.199788 -0.401429 -0.374292 -0.230361 -0.079441 -0.338879 -0.467495 -0.599393 -0.641197 -0.592097 -0.471002 0.112598 -0.007454 -0.703834 0.318387 0.262176 0.344046 0.310565 0.240477 0.243865 0.224835 0.264275 0.358132 0.368547 0.228107 0.218929 0.231973 0.223772 0.260477 0.246781 0.249145
chargesum: 0.00000
title: Mulliken charges with hydrogens summed into heavy atoms:
elementType: S O O O N C C C C C C C C C
charge: 0.199788 -0.401429 -0.374292 -0.230361 -0.079441 0.241684 -0.123450 0.195514 0.206046 0.223486 -0.015257 0.112598 -0.007454 0.052568
polarizability: 1.68036437e+02 -1.96094080e+00 1.31934392e+02 -1.21907745e+00 6.32604376e+00 1.06010366e+02
1716.lowfreq: -10.4423 -0.0015 0.0017 0.0021 6.0307 13.6249 23.2230 45.7886 60.0430
frequency: 22.5082 45.6646 60.0163 79.4225 83.6433 114.8453 133.9105 138.5701 190.8427 199.2054 238.0600 247.1773 275.3256 332.0817 340.5080 364.6832 370.1270 375.5203 384.5335 430.5313 443.3580 452.5888 471.0368 504.5221 514.2490 589.9560 595.6219 647.8006 721.2729 749.6880 836.6236 849.0284 895.1818 907.6672 928.4004 962.3208 967.6768 1007.6812 1020.2389 1068.2987 1079.7251 1109.1419 1114.5688 1128.5280 1144.1354 1209.6632 1218.3470 1233.7936 1236.5811 1252.0121 1255.2967 1299.3914 1327.1356 1377.3416 1401.6311 1423.8483 1438.3705 1441.6542 1445.6730 1452.6193 1453.2070 1454.3906 1471.5046 1478.4064 1486.4968 1490.9031 1505.4754 1523.7445 1546.7003 1592.8527 2907.5939 2941.8600 2993.4230 3010.3304 3012.7189 3025.7475 3069.6622 3082.5216 3086.1047 3086.9150 3105.5328 3110.2083 3119.2398 3121.6220 3126.8843 3131.1405 3137.6737
redmass: 5.5063 2.6978 1.5251 5.1245 2.8599 4.2289 5.1037 3.7553 8.1319 6.3655 3.2308 3.8771 1.1065 1.3155 2.1383 4.0033 2.4010 1.1250 2.4691 2.5826 2.3738 2.7988 6.1767 2.7506 3.5303 4.1691 7.3353 5.7266 4.3000 5.6472 3.3527 5.3059 3.0260 2.4868 2.3546 2.4705 2.3816 1.5477 1.8128 1.1913 3.0243 1.2797 1.9457 1.4916 1.4299 1.2553 1.5316 1.7574 2.4254 1.9036 1.6808 1.2638 1.1979 1.1913 1.1648 1.1392 1.1033 1.1600 1.0610 1.0818 1.0680 1.0880 1.1526 1.0584 1.0771 1.0484 1.0763 1.0479 3.8944 8.9363 1.0541 1.0485 1.0365 1.0344 1.0612 1.0579 1.0858 1.0922 1.0959 1.0866 1.1033 1.1036 1.1019 1.1047 1.1035 1.1041 1.1055
irintensity: 6.3049 0.6113 3.4685 0.9665 2.5215 5.6303 3.4738 2.7504 39.2957 12.2837 6.3439 12.1912 0.7503 3.2052 3.9578 0.9876 1.1966 1.2313 0.6382 1.8663 0.2256 6.6071 1.3542 4.4710 3.1327 64.4267 51.4155 2.1895 1.2276 2.9332 25.0557 38.7227 21.9758 16.0105 12.2686 36.3304 29.4997 7.4798 3.5977 0.3991 40.9945 31.1723 142.8179 8.8825 5.6506 1.7151 34.7343 81.3591 105.8173 34.4454 0.5044 2.6276 0.7098 41.2452 26.6213 5.0320 25.2534 81.8624 28.8022 26.7917 33.2353 3.3719 60.9471 3.1606 4.4013 1.8411 17.8986 55.3585 231.5573 170.7236 115.4885 143.0198 1.6879 16.7097 37.4183 15.6113 5.6879 14.0201 5.4601 4.0211 12.2719 0.7031 7.0334 3.9141 13.6268 21.2520 0.5455
temp: 298.150 k
press: 1.00000 atm
elementType: 16 8 8 8 7 6 6 6 6 6 6 6 6 6 1 1 1 1 1 1 1 1 1 1 1 1 1 1 1 1 1
symmnumber: 1
zpe: 671240.8 jmol-1
zpe.correction: 0.255662 hartree
zpe.thermalcorrener: 0.272260 hartree
zpe.thermalcorrenthalpy: 0.273205 hartree
zpe.thermalcorrgfe: 0.210826 hartree
zpe.sumelectzpe: -1030.464248 hartree
zpe.sumelectthermal: -1030.447649 hartree
zpe.sumelectthermalent: -1030.446705 hartree
zpe.sumelectthermalfe: -1030.509084 hartree
dipole: -6.9692 7.9951 -2.2855
dipole: 10.8496
quadrupole: -103.2846 -87.7171 -97.0557
quadrupole: 20.0346 -3.2597 0.1254
quadrupole: -7.2655 8.3020 -1.0366 20.0346 -3.2597 0.1254
hfenergy: -1030.7199098 hartree
pointgroup: C01 [X(C9H17N1O3S1)]
dipole: 3.451965 2.4938165 0.292397 debye
polarizability: 164.9419123|-6.9907707|132.4517566|-11.5959529|-5.6832688|108.5875259 unknown
InChI: InChI=1S/C9H17NO3S/c1-7(11)14-8(5-9(12)13)6-10(2,3)4/h8H,5-6H2,1-4H3
charge 0 multiplicity 1
31 atoms
S  1.596684 -1.497371 0.414145
O  -3.07514 -0.356663 1.318114
O  -2.975254 -0.825326 -0.973851
O  2.171752 0.723387 -1.078474
N  -0.788418 1.913099 0.263903
C  -0.240455 0.613334 0.989256
C  -0.132889 -0.684329 0.142228
C  0.297418 2.98321 0.31422
C  -1.175517 1.707628 -1.204517
C  -2.024534 2.407632 1.027347
C  -1.233518 -1.708614 0.481462
C  -2.58493 -0.93858 0.256586
C  2.636325 -0.32923 -0.565677
C  4.078699 -0.77154 -0.71232
H  -0.955042 0.421149 1.809416
H  0.739676 0.905377 1.393133
H  -0.147024 -0.478302 -0.938228
H  1.180256 2.603523 -0.221693
H  -0.083765 3.897475 -0.168506
H  0.544043 3.197005 1.366335
H  -1.595462 2.661741 -1.56338
H  -0.267301 1.461431 -1.774488
H  -1.933615 0.904919 -1.285594
H  -2.766439 1.582496 1.056906
H  -1.716989 2.665998 2.053989
H  -2.416415 3.299681 0.512028
H  -1.16175 -2.570421 -0.202544
H  -1.157584 -2.043973 1.530234
H  4.223226 -1.183714 -1.728845
H  4.353649 -1.548334 0.018698
H  4.74801 0.099616 -0.60848
