program: Gaussian 09
title: 000195944
version: EM64L-G09RevD.01
frameworkgroup: C1[X(C11H18N4O8)]
method: RPBEPBE
basis: SDD
operation: Freq
keyword: #p
keyword: freq=noraman
keyword: PBEPBE/SDD
title: #p freq=noraman PBEPBE/SDD
converged: YES YES NO NO
title: Mulliken charges:
elementType: O O O O O O O O N N N N C C C C C C C C C C C H H H H H H H H H H H H H H H H H H
charge: -0.446556 -0.502688 -0.451272 -0.451149 -0.298112 -0.201184 -0.373746 -0.190081 -0.386583 -0.105373 0.034604 -0.070678 -0.117555 -0.165300 -0.108843 -0.128326 -0.111948 -0.557679 -0.448116 0.246205 0.085871 -0.795744 0.158109 0.265753 0.222145 0.262416 0.295332 0.263106 0.268787 0.321973 0.340815 0.262590 0.267724 0.389000 0.367933 0.343982 0.358146 0.254156 0.264901 0.241770 0.395610
chargesum: 0.00000
title: Mulliken charges with hydrogens summed into heavy atoms:
elementType: O O O O O O O O N N N N C C C C C C C C C C C
charge: -0.057556 -0.134755 -0.107290 -0.093002 -0.298112 -0.201184 0.021864 -0.190081 -0.045768 -0.105373 0.034604 -0.070678 0.148198 0.056846 0.153573 0.167006 0.151158 0.033081 0.082198 0.246205 0.085871 -0.034917 0.158109
polarizability: 1.92877642e+02 1.08240830e+01 1.91290948e+02 9.56911460e+00 2.16757656e+01 1.36269320e+02
1716.lowfreq: -59.9498 -14.3441 -5.0032 -4.7268 -0.0005 -0.0002 0.0005 16.3204 22.8369
frequency: -59.8034 16.1838 22.7711 29.2036 37.8625 44.8048 50.4585 62.4354 71.8661 85.5241 92.6660 107.5718 112.9441 132.7795 158.6109 179.8698 180.7082 200.3428 234.3842 237.8295 257.4283 266.4591 270.3713 288.9476 301.2525 320.5558 362.4150 368.1362 385.7321 402.6864 417.1779 452.9085 458.1093 477.3416 492.6940 520.0778 538.1318 565.9956 576.4623 586.1073 590.7612 600.3970 622.4496 643.8931 685.4564 700.4275 720.4539 728.2601 762.8787 809.5611 838.2479 853.3196 890.3365 899.6083 914.9818 963.3783 973.9857 977.0781 1011.1909 1023.6226 1029.5825 1039.7714 1047.9543 1077.0306 1089.9993 1092.6004 1121.7764 1142.1655 1167.1121 1195.3015 1204.3275 1207.0088 1219.7095 1241.8487 1246.8601 1257.0944 1282.9922 1288.9491 1291.7104 1317.4147 1331.5098 1340.6922 1363.2821 1365.4448 1370.0516 1371.5097 1378.8062 1383.3912 1390.4917 1397.8538 1430.0027 1444.0726 1452.3430 1465.3261 1492.7210 1600.6312 1607.8316 1684.7442 2056.8895 2918.9378 2965.7929 2992.4172 3000.5095 3015.9449 3027.7403 3041.6279 3045.8894 3071.0278 3077.4663 3099.8386 3136.4616 3359.2073 3447.4100 3478.2350 3514.9373 3550.1687 3589.2029
redmass: 1.1012 9.6808 9.8053 7.5330 7.1421 7.7669 7.4226 5.5048 6.8584 5.6044 6.2409 7.2845 3.9537 5.9515 4.9338 7.3372 7.3954 5.7704 5.2434 4.9803 4.8506 4.7236 4.3088 3.7058 1.3801 3.5925 4.7784 1.1454 5.0116 4.0895 3.4817 2.9653 1.8885 3.0844 2.8910 6.3869 3.7778 1.7247 1.9576 5.5731 1.8867 2.5868 4.4339 2.8012 2.4907 4.3530 1.3158 4.7085 4.2026 4.9689 4.4841 5.0562 3.0166 2.4878 3.7594 3.6980 1.8049 3.2470 2.8112 3.4681 3.9980 1.6990 3.1009 2.4033 2.2273 2.0665 1.7402 3.0767 1.6733 1.1519 1.3558 1.3481 1.3480 1.2853 1.4424 1.4526 1.7044 2.1641 3.0945 1.3060 1.3944 1.3399 1.4203 1.3636 1.3447 1.3487 1.2897 1.2560 1.1461 1.6444 1.1310 1.1656 1.0816 1.0554 1.5291 6.0803 6.1806 9.1801 13.5074 1.0696 1.0826 1.0382 1.0836 1.0855 1.0623 1.0810 1.0877 1.0864 1.0979 1.1073 1.0985 1.0635 1.0656 1.0776 1.0658 1.0660 1.0666
irintensity: 0.0901 1.0943 0.3642 0.8753 0.7413 3.4857 3.6847 7.3467 2.5540 2.5423 1.9319 11.9639 10.4842 2.2182 3.8223 27.8917 3.9024 0.5683 1.6713 13.5952 22.1455 0.5111 47.9623 36.5113 150.5971 6.3685 7.2982 140.2783 25.7828 2.9825 1.0804 80.0467 21.4872 17.4934 13.6239 3.4313 28.0928 78.0249 82.6606 12.2957 86.4987 41.4060 12.9827 34.0923 39.8821 6.8345 97.4276 29.0085 11.1520 24.9298 14.3980 14.0782 16.2284 17.3048 13.6497 78.1514 21.8833 13.9015 52.8953 60.5016 75.5271 11.2498 36.0855 47.4328 33.2209 6.2828 17.6124 4.7569 37.5039 38.4605 20.1847 60.5515 18.5708 186.5934 411.8624 54.5528 51.6162 16.8423 43.3741 9.6278 4.7485 9.3928 23.4404 25.5730 28.3465 64.0560 0.8505 56.8074 24.2464 4.1224 56.6743 72.1849 23.6503 18.3452 163.8725 157.7163 40.9188 139.6909 323.5489 131.6256 24.2368 4.7587 18.0226 18.8370 5.9481 16.6286 11.2618 5.5296 7.2559 4.7723 5.0941 59.7470 39.6484 65.1646 42.9613 8.3212 10.3071
temp: 298.150 k
press: 1.00000 atm
elementType: 8 8 8 8 8 8 8 8 7 7 7 7 6 6 6 6 6 6 6 6 6 6 6 1 1 1 1 1 1 1 1 1 1 1 1 1 1 1 1 1 1
symmnumber: 1
zpe: 809870.1 jmol-1
zpe.correction: 0.308463 hartree
zpe.thermalcorrener: 0.333505 hartree
zpe.thermalcorrenthalpy: 0.334449 hartree
zpe.thermalcorrgfe: 0.250417 hartree
zpe.sumelectzpe: -1248.888136 hartree
zpe.sumelectthermal: -1248.863095 hartree
zpe.sumelectthermalent: -1248.862151 hartree
zpe.sumelectthermalfe: -1248.946183 hartree
dipole: 3.0248 -0.5240 2.6408
dipole: 4.0494
quadrupole: -160.7662 -154.1821 -127.7921
quadrupole: 12.3515 8.3111 -0.5087
quadrupole: -13.1861 -6.6019 19.7880 12.3515 8.3111 -0.5087
hfenergy: -1249.1965997 hartree
pointgroup: C01 [X(C11H18N4O8)]
dipole: -1.2061235 -0.2554801 1.0090408 debye
polarizability: 193.6518721|13.9961463|196.8049071|-2.8243377|9.6026779|129.981131 unknown
InChI: InChI=1S/C11H18N4O8/c1-4(16)14-8(5(17)2-6(18)11(22)23)10(21)9(20)7(19)3-13-15-12/h5,7-10,14,17,19-22H,2-3H2,1H3
charge 0 multiplicity 1
41 atoms
O  -0.197437 2.286553 1.593141
O  -2.56063 -0.522726 1.429982
O  2.1292 0.616139 1.988395
O  -4.020796 2.105468 0.30184
O  0.454538 -1.517688 -1.908578
O  4.338993 1.443479 -0.574171
O  6.510681 -0.10372 -0.545322
O  5.218302 -1.96765 -0.070861
N  -0.043414 -1.254082 0.348049
N  -4.00197 -0.114214 -1.239771
N  -3.915344 -1.372466 -1.20012
N  -4.011327 -2.55548 -1.170765
C  0.258061 0.193703 0.346364
C  -0.58732 0.882749 1.458166
C  -2.122878 0.887963 1.288873
C  1.763666 0.54947 0.552747
C  -2.674776 1.577124 0.018386
C  2.725407 -0.373706 -0.212795
C  -2.741224 0.717694 -1.273031
C  -0.007874 -2.00234 -0.824188
C  4.097239 0.219877 -0.371884
C  -0.542038 -3.42311 -0.711544
C  5.312826 -0.750061 -0.313004
H  0.009203 0.596675 -0.655074
H  -0.389699 0.340185 2.407715
H  -2.512514 1.490118 2.133395
H  1.90899 1.588627 0.21294
H  -2.040641 2.463162 -0.16882
H  2.80051 -1.374833 0.249384
H  2.30455 -0.556279 -1.228839
H  -0.659906 -1.588451 1.097897
H  -1.848931 0.08736 -1.419721
H  -2.851202 1.392616 -2.138498
H  0.671346 2.298825 2.076298
H  -3.494094 -0.540397 1.755685
H  2.144125 -0.299753 2.367697
H  -4.676142 1.435633 -0.040069
H  -1.591805 -3.433821 -0.365112
H  -0.489473 -3.9049 -1.698301
H  0.059979 -4.011294 0.00484
H  6.319924 0.871553 -0.695228
