program: Gaussian 09
title: 000195959
version: EM64L-G09RevD.01
frameworkgroup: C1[X(C15H20F3N3O)]
method: RPBEPBE
basis: SDD
operation: Freq
keyword: #p
keyword: freq=noraman
keyword: PBEPBE/SDD
title: #p freq=noraman PBEPBE/SDD
converged: YES YES NO NO
title: Mulliken charges:
elementType: F F F O N N N C C C C C C C C C C C C C C C H H H H H H H H H H H H H H H H H H H H
charge: -0.167174 -0.174066 -0.170157 -0.276561 -0.085386 -0.181175 -0.358358 -0.363656 -0.377238 -0.380862 -0.394541 -0.316539 0.502828 -0.402369 -0.490081 -0.380196 0.309657 -0.210833 -0.396203 0.241683 0.248966 -0.770577 0.224632 0.198061 0.188813 0.212521 0.206395 0.222708 0.217210 0.218839 0.224548 0.197045 0.232415 0.251007 0.262263 0.226412 0.298431 0.230183 0.262959 0.256037 0.253452 0.208906
chargesum: 0.00000
title: Mulliken charges with hydrogens summed into heavy atoms:
elementType: F F F O N N N C C C C C C C C C C C C C C C
charge: -0.167174 -0.174066 -0.170157 -0.276561 -0.085386 -0.181175 -0.059927 0.059037 0.024095 0.048241 0.041508 0.105054 0.502828 0.081052 -0.227818 -0.153784 0.309657 0.019351 -0.133244 0.241683 0.248966 -0.052183
polarizability: 2.79704236e+02 -1.07742525e+01 1.84931078e+02 1.18498883e+00 3.53977316e+00 1.17396793e+02
1716.lowfreq: -9.3606 -3.7462 -1.1429 -0.0009 -0.0002 0.0007 14.4280 14.8578 16.7251
frequency: 14.2240 14.3388 16.3814 30.4508 46.7616 59.8709 63.1465 82.7995 106.8086 115.4209 126.6980 151.8642 206.2949 225.6776 245.6510 249.4951 279.9907 293.1177 305.7547 310.2334 343.6604 355.1555 376.1404 408.5108 429.9330 445.1824 451.8626 474.2523 489.3591 516.3217 530.0581 544.8544 602.5169 606.9300 608.8311 628.7672 640.9846 682.4212 689.8717 760.1684 764.5668 784.9554 792.3512 842.4169 865.8165 876.3101 886.4370 932.7319 950.2850 971.8529 975.8343 977.8310 978.7165 1001.1662 1011.1363 1039.0668 1042.5966 1048.9569 1058.7476 1071.1187 1080.6378 1094.8737 1102.2620 1107.4097 1143.4635 1155.5225 1181.8003 1192.1213 1206.0146 1234.5217 1243.6246 1260.7061 1271.5418 1280.3130 1303.1674 1306.6430 1318.6901 1324.5046 1347.4242 1351.9094 1365.2620 1373.6511 1378.2637 1389.2649 1394.6018 1397.3360 1442.6468 1450.4422 1450.6335 1456.4141 1456.5469 1462.5492 1467.1318 1469.0355 1480.3030 1486.1854 1497.0479 1586.5054 1616.6604 1623.1664 2861.1702 2872.0769 2905.8156 2922.6894 2935.6850 2995.9081 3023.2433 3025.0141 3036.8385 3057.2133 3060.2465 3092.3351 3094.6534 3097.6234 3098.8881 3140.4545 3166.0564 3179.2235 3182.6468 3564.1693
redmass: 6.0361 5.7818 8.8383 4.8932 3.4687 4.1011 4.3824 1.3587 2.8293 3.2623 5.8248 3.6920 5.9089 2.5302 2.4750 3.0012 2.7103 5.9005 4.6220 3.2346 6.4480 3.4825 4.3060 2.2053 4.7874 4.9844 3.6748 2.7849 4.6468 1.6081 4.5026 3.5050 2.6515 5.6576 4.6418 4.4182 2.7766 5.4013 2.0043 1.4426 4.4823 2.2103 2.0347 1.6045 1.6389 2.5533 1.4085 4.3105 2.2317 1.7279 3.4302 6.5325 1.7565 2.6469 6.7435 2.2550 1.9990 2.2795 2.6555 2.2068 2.1101 2.6156 2.6191 1.7894 2.6314 3.1381 2.0749 1.1078 1.1343 1.6169 1.6376 1.8717 1.9566 1.5029 1.3554 1.2203 1.2857 1.3334 1.3360 1.4181 1.7781 1.7896 1.3736 1.2417 1.3919 3.7611 1.1378 3.3170 1.0520 1.1323 1.0959 1.1075 1.1065 1.0974 1.1016 1.8012 2.6966 5.8150 6.1842 6.1047 1.0706 1.0706 1.0683 1.0684 1.0707 1.0362 1.0857 1.0654 1.0895 1.0898 1.0912 1.1051 1.0896 1.1003 1.0982 1.0869 1.0921 1.0927 1.0949 1.0783
irintensity: 2.3904 1.4197 1.2753 4.9500 1.2599 8.7922 1.2184 1.0476 1.7157 1.5541 0.6320 4.7329 0.6690 3.0895 0.8611 9.5376 2.3445 1.0630 3.3684 10.8033 3.8009 3.0036 0.7343 3.8266 0.4232 9.8059 7.6664 1.2409 3.6885 84.0249 20.0357 21.6150 2.0587 13.3004 5.6559 5.0615 6.1429 2.2058 26.2178 7.5967 12.1602 44.9304 23.2527 0.9560 32.3996 0.6624 14.8821 141.7118 5.4155 12.1431 54.1904 179.8790 7.4415 50.6794 158.5889 7.1795 6.2304 12.7240 51.0300 18.6531 5.9658 10.4479 1.1897 4.8713 79.5595 40.7005 0.3647 0.3117 9.8270 27.5592 57.1928 167.0550 184.0223 99.9074 89.7064 24.5406 1.6508 1.8599 3.1857 2.4364 41.9500 25.0835 8.3621 61.3343 7.2615 50.8358 35.2984 80.3066 12.8779 27.2955 13.9845 55.5073 47.1407 4.1076 12.0649 142.4791 91.8229 15.6147 145.2784 189.8562 60.5538 61.6989 80.8476 53.9762 85.7582 13.5441 17.0545 29.4736 49.6850 36.2231 19.6744 14.0817 18.2445 23.2398 9.9639 11.7060 15.0571 6.4929 3.0394 14.8476
temp: 298.150 k
press: 1.00000 atm
elementType: 9 9 9 8 7 7 7 6 6 6 6 6 6 6 6 6 6 6 6 6 6 6 1 1 1 1 1 1 1 1 1 1 1 1 1 1 1 1 1 1 1 1
symmnumber: 1
zpe: 882045.0 jmol-1
zpe.correction: 0.335953 hartree
zpe.thermalcorrener: 0.357874 hartree
zpe.thermalcorrenthalpy: 0.358819 hartree
zpe.thermalcorrgfe: 0.280188 hartree
zpe.sumelectzpe: -1120.932880 hartree
zpe.sumelectthermal: -1120.910959 hartree
zpe.sumelectthermalent: -1120.910015 hartree
zpe.sumelectthermalfe: -1120.988646 hartree
dipole: 6.4766 -1.7076 -0.3607
dipole: 6.7076
quadrupole: -139.5764 -123.2348 -133.5702
quadrupole: -34.0129 -1.5700 -0.9924
quadrupole: -7.4493 8.8923 -1.4431 -34.0129 -1.5700 -0.9924
hfenergy: -1121.2688336 hartree
pointgroup: C01 [X(C15H20F3N3O1)]
dipole: -2.570113 -0.3829808 0.4605219 debye
polarizability: 279.9203428|10.9725696|146.3786744|-0.7534564|-33.1599734|155.7330899 unknown
InChI: InChI=1S/C15H20F3N3O/c1-12(22)19-5-6-20-7-9-21(10-8-20)14-4-2-3-13(11-14)15(16,17)18/h2-4,11,19H,5-10H2,1H3
charge 0 multiplicity 1
42 atoms
F  6.517984 0.388193 1.072721
F  4.931237 -0.573369 2.382908
F  5.643718 -1.622248 0.509222
O  -6.129116 0.891022 -1.219863
N  -2.288492 -0.270813 0.639827
N  0.476922 0.314401 0.002792
N  -6.081029 -0.154219 0.853098
C  -1.947854 0.659305 -0.465394
C  -1.252124 -1.323868 0.724866
C  -0.590807 1.325588 -0.193523
C  0.131807 -0.710222 1.010374
C  -3.671301 -0.794559 0.54798
C  1.826979 0.641418 -0.234848
C  -4.685458 0.231403 1.115016
C  2.880995 0.055519 0.528971
C  2.200878 1.547365 -1.279226
C  4.230631 0.350577 0.23816
C  3.550892 1.837345 -1.54436
C  4.590757 1.240151 -0.79725
C  5.303014 -0.336374 1.032243
C  -6.717561 0.206549 -0.326379
C  -8.162862 -0.261212 -0.472671
H  -2.722924 1.440807 -0.547189
H  -1.906948 0.120399 -1.445295
H  -1.190168 -1.919944 -0.221028
H  -1.505746 -2.015266 1.549346
H  -0.340193 1.981387 -1.040723
H  -0.680655 1.960085 0.716324
H  0.135731 -0.279289 2.03743
H  0.876348 -1.523587 0.971407
H  -3.961997 -1.038745 -0.501168
H  -3.731248 -1.731478 1.133965
H  -4.529334 0.349295 2.201351
H  -4.52262 1.210915 0.634256
H  2.661832 -0.601774 1.373151
H  1.434602 2.011553 -1.906388
H  -6.58022 -0.718802 1.540884
H  3.797446 2.530931 -2.355335
H  5.640137 1.465553 -1.003284
H  -8.811642 0.619256 -0.620217
H  -8.251641 -0.885945 -1.378125
H  -8.532777 -0.835004 0.394975
