program: Gaussian 09
title: 000195951
version: EM64L-G09RevD.01
frameworkgroup: C1[X(C21H36O2)]
method: RPBEPBE
basis: SDD
operation: Freq
keyword: #pfreq=noraman
keyword: PBEPBE/SDD
title: #p freq=noraman PBEPBE/SDD
converged: NO YES NO NO
title: Mulliken charges:
elementType: O O C C C C C C C C C C C C C C C C C C C C C H H H H H H H H H H H H H H H H H H H H H H H H H H H H H H H H H H H H
charge: -0.439445 -0.435210 -0.090071 -0.118193 0.371357 -0.113785 0.451238 -0.056523 -0.530355 -0.518761 -0.527268 -0.496103 -0.243251 -0.511539 -0.502030 -0.529483 -0.069227 -0.825207 -0.450326 -0.867082 -0.455567 -0.081934 -0.741003 0.187828 0.214619 0.185874 0.188898 0.222745 0.203089 0.211513 0.210867 0.192667 0.235618 0.195599 0.211484 0.221103 0.214754 0.208451 0.205028 0.199272 0.203087 0.216257 0.202493 0.222371 0.213446 0.222339 0.203551 0.190507 0.217570 0.236126 0.219551 0.217595 0.193643 0.215078 0.237269 0.208989 0.206541 0.326383 0.317562
chargesum: 0.00000
title: Mulliken charges with hydrogens summed into heavy atoms:
elementType: O O C C C C C C C C C C C C C C C C C C C C C
charge: -0.113063 -0.117649 0.097757 0.096426 0.371357 0.072089 0.451238 0.132375 -0.104521 -0.096381 -0.098983 -0.089019 -0.022148 -0.088334 -0.097730 -0.110139 0.133266 -0.167050 -0.056267 -0.193835 -0.044328 0.133144 -0.088204
polarizability: 2.55864578e+02 1.70342466e+00 2.06426289e+02 2.74724716e+00 1.19268993e+00 1.96247771e+02
1716.lowfreq: -24.3826 -11.1421 -0.0005 -0.0004 0.0004 11.5247 29.0708 49.3753 76.0258
frequency: 28.2966 49.1938 75.7148 89.4861 122.0768 132.3712 140.6603 159.4015 189.3099 193.7938 199.6759 211.9809 216.7200 245.5192 263.5808 268.1871 279.3215 283.5967 288.1765 292.7631 304.7427 313.6616 317.4491 338.0670 344.4560 362.4754 387.5282 401.7624 413.6988 429.4907 451.9333 454.8652 457.4067 462.3789 478.5749 491.8004 503.5024 518.1176 573.1687 590.4631 621.7681 635.5881 720.3410 737.0273 779.5917 801.4685 820.9915 824.9499 837.0875 846.2227 853.6055 898.4405 906.2842 907.7106 912.8465 927.1514 938.7664 946.4010 959.6105 964.8274 974.6146 981.3243 992.5097 1008.3995 1017.5054 1020.5164 1027.7080 1039.3868 1042.0110 1060.8069 1065.1505 1069.4948 1084.5385 1094.0718 1102.9087 1109.7458 1116.5956 1121.5400 1134.5439 1141.6410 1149.1106 1158.6897 1166.4926 1172.0791 1179.3694 1196.9166 1204.2500 1207.5163 1214.5129 1232.7070 1244.9585 1248.1086 1257.1225 1266.8190 1268.2615 1283.9229 1288.9657 1294.9306 1297.0822 1307.8623 1312.4644 1319.4307 1321.0416 1322.2032 1330.2198 1333.7890 1335.4320 1337.5191 1340.4807 1344.8795 1347.5694 1350.6594 1353.5011 1355.9248 1361.4530 1366.5790 1374.8791 1384.7596 1386.1490 1387.8034 1459.4259 1461.4075 1462.6855 1464.7387 1467.1591 1468.9479 1469.9476 1472.1264 1472.3889 1476.0939 1478.5928 1481.3474 1486.6692 1488.3699 1494.4574 2892.9181 2926.4450 2935.2705 2936.8353 2951.1979 2953.5604 2956.6788 2960.9259 2963.0739 2965.6208 2970.7791 2971.9632 2972.3649 2975.7437 2976.4062 2980.0700 2986.2390 2996.7458 3016.7006 3020.9749 3022.0191 3030.7478 3034.3578 3035.7631 3037.6489 3041.9865 3045.1907 3048.8855 3057.6200 3061.4873 3063.8464 3077.5706 3081.6028 3086.5551 3542.0639 3544.1122
redmass: 4.0965 3.8836 3.4249 2.5316 2.4194 1.5685 2.9676 2.3670 1.3552 2.0428 1.2515 2.2671 2.1525 2.4392 1.6092 2.7886 2.5920 2.7327 2.5887 2.3226 2.4621 2.0955 1.1966 2.6862 2.2375 2.9143 2.7987 3.0474 2.9214 2.6134 2.5443 2.8084 2.5178 3.1773 2.9646 2.7252 2.8638 2.4643 2.6081 2.7203 2.3220 2.6671 2.8786 2.3386 2.1256 2.0710 2.3112 1.9272 2.4347 2.2411 1.8172 1.7127 2.0373 1.6977 1.8959 1.8063 1.7940 1.8820 1.8502 2.2647 1.8006 2.3268 2.1498 2.0836 1.9173 2.0107 1.7278 2.2994 1.9146 2.2028 1.9984 2.0021 2.1437 2.2423 1.3246 1.8879 2.0006 1.5964 1.8270 2.0533 1.8812 1.4944 1.9226 2.0985 2.2512 2.2540 1.5793 1.8715 1.5165 1.5823 1.4642 1.4445 1.4676 1.4995 1.3234 1.3599 1.3963 1.4442 1.3048 1.3598 1.2901 1.4115 1.3776 1.3945 1.4635 1.4000 1.4424 1.4514 1.4287 1.4605 1.4478 1.4605 1.4466 1.4464 1.4005 1.2063 1.2239 1.2132 1.2049 1.2162 1.0741 1.0857 1.0757 1.0748 1.0831 1.0773 1.0573 1.0773 1.0823 1.0850 1.0705 1.0558 1.0664 1.0618 1.0600 1.0804 1.0791 1.0807 1.0809 1.0772 1.0673 1.0631 1.0678 1.0667 1.0621 1.0590 1.0372 1.0469 1.0578 1.0590 1.0456 1.0595 1.0847 1.0875 1.0968 1.0977 1.0958 1.0974 1.0935 1.0984 1.0991 1.0967 1.0980 1.0977 1.0988 1.0968 1.0975 1.0967 1.0986 1.0658 1.0656
irintensity: 0.1030 0.6812 0.5669 0.6943 0.8204 0.6345 1.9707 1.9001 1.1838 0.8416 0.6480 1.9478 1.4575 3.5037 29.9742 6.3430 1.5725 4.8481 10.7813 14.0500 0.2415 51.1607 117.5511 10.5940 12.0857 8.6646 3.2442 2.7773 3.4189 1.2182 1.2889 1.7269 2.5910 2.4014 9.9308 0.4699 0.1618 0.9486 1.3203 6.1765 1.1511 3.4590 0.5582 0.9120 1.2312 0.1448 13.6888 10.0179 8.1118 6.8385 2.2745 7.6110 10.2536 8.5260 5.2324 2.5489 3.8349 11.5936 31.5671 31.4414 45.4709 65.6776 13.5203 3.9468 25.3023 1.3970 11.9577 10.1176 4.2028 9.3124 7.4169 4.7809 2.0635 2.7666 0.9326 4.0583 1.8036 10.3185 5.5295 7.7457 5.4789 2.3858 3.5518 5.7863 4.8695 10.4737 1.6977 9.3697 5.1085 0.9792 5.8699 3.6383 8.8336 5.6374 2.1774 0.1858 3.9905 5.3514 1.8932 5.3956 1.4934 5.7402 1.6703 2.6191 0.7167 0.9659 1.0548 1.6348 0.6030 2.3810 2.8014 6.6504 4.7651 1.5156 6.2902 19.8284 42.1162 11.9373 4.6842 45.8304 0.5767 2.7896 7.4012 5.1793 16.0707 15.0830 21.3871 10.6142 11.7858 6.0683 6.1603 10.3101 1.1368 8.7802 5.5269 12.8469 8.2876 9.4728 23.4202 4.8290 24.8605 38.4259 23.0729 10.0489 8.5243 51.7362 44.1954 62.0812 60.8344 18.0542 28.8494 64.2737 33.1427 2.6914 33.0758 55.8940 11.4738 30.6087 56.9105 73.5792 78.2335 42.2799 77.0633 62.8999 42.9213 42.5035 42.0644 34.0746 24.2951 6.5691 5.1699
temp: 298.150 k
press: 1.00000 atm
elementType: 8 8 6 6 6 6 6 6 6 6 6 6 6 6 6 6 6 6 6 6 6 6 6 1 1 1 1 1 1 1 1 1 1 1 1 1 1 1 1 1 1 1 1 1 1 1 1 1 1 1 1 1 1 1 1 1 1 1 1
symmnumber: 1
zpe: 1394868.5 jmol-1
zpe.correction: 0.531277 hartree
zpe.thermalcorrener: 0.554367 hartree
zpe.thermalcorrenthalpy: 0.555311 hartree
zpe.thermalcorrgfe: 0.482104 hartree
zpe.sumelectzpe: -970.441250 hartree
zpe.sumelectthermal: -970.418160 hartree
zpe.sumelectthermalent: -970.417216 hartree
zpe.sumelectthermalfe: -970.490424 hartree
dipole: 1.7250 0.9497 -2.4832
dipole: 3.1691
quadrupole: -160.6182 -146.4653 -146.0368
quadrupole: 7.2372 3.0969 3.1315
quadrupole: -9.5781 4.5748 5.0033 7.2372 3.0969 3.1315
hfenergy: -970.9725274 hartree
pointgroup: C01 [X(C21H36O2)]
dipole: 0.673951 -0.4574783 0.943986 debye
polarizability: 255.902513|-1.366187|206.1297847|-2.5380544|2.0595306|196.5063405 unknown
InChI: InChI=1S/C21H36O2/c1-13-4-7-17-16-6-5-14-12-15(22)8-10-20(14,2)18(16)9-11-21(17,3)19(13)23/h13-19,22-23H,4-12H2,1-3H3
charge 0 multiplicity 1
59 atoms
O  4.156809 1.981561 -0.572796
O  -4.688042 -0.222823 -2.776793
C  -0.88756 0.478471 0.311256
C  0.015246 -0.71188 0.785225
C  -2.33622 0.448312 0.935674
C  1.399379 -0.666096 0.056084
C  2.153094 0.698711 0.258296
C  -3.006769 -0.944598 0.650668
C  -0.154301 1.829546 0.511744
C  -0.695916 -2.071368 0.557204
C  1.211436 1.846121 -0.204883
C  -2.121527 -2.110709 1.152444
C  3.417802 0.699245 -0.667687
C  2.331281 -1.863261 0.374293
C  -3.258028 1.558424 0.33125
C  -3.398208 -1.139368 -0.842442
C  4.373281 -0.502387 -0.452071
C  -2.290889 0.697545 2.470851
C  3.586557 -1.836347 -0.524581
C  2.576023 0.932924 1.735293
C  -3.619546 1.362716 -1.1591
C  -4.296292 -0.004157 -1.367711
C  5.532698 -0.489296 -1.472295
H  -1.001973 0.347261 -0.788846
H  0.193426 -0.606892 1.877264
H  1.171992 -0.728245 -1.036277
H  -3.956613 -0.960937 1.230818
H  -0.016024 2.033175 1.591444
H  -0.768672 2.660148 0.116044
H  -0.106137 -2.889364 1.010598
H  -0.733248 -2.280562 -0.532561
H  1.041673 1.741402 -1.298199
H  1.720212 2.817699 -0.061231
H  -2.604326 -3.076492 0.900768
H  -2.05372 -2.075238 2.257803
H  3.072892 0.692265 -1.721593
H  1.802431 -2.818551 0.204791
H  2.620951 -1.850073 1.444655
H  -2.806331 2.556557 0.483107
H  -4.202035 1.561668 0.917028
H  -2.492441 -1.194064 -1.480906
H  -3.927945 -2.104566 -0.958439
H  4.809942 -0.413414 0.568027
H  -2.01678 1.744519 2.695515
H  -3.287917 0.515119 2.916013
H  -1.569748 0.044812 2.99243
H  4.264478 -2.673774 -0.266735
H  3.273066 -1.999269 -1.578072
H  2.976963 1.95652 1.861445
H  1.72071 0.839889 2.425328
H  3.345204 0.217085 2.075922
H  -4.299709 2.166443 -1.498386
H  -2.709558 1.420731 -1.792759
H  -5.266816 -0.018696 -0.837128
H  6.072897 0.472899 -1.453401
H  6.252372 -1.302786 -1.262776
H  5.146927 -0.635828 -2.499759
H  4.627668 1.998768 0.299766
H  -3.864319 -0.218096 -3.329321
