program: Gaussian 09
title: 000195971
version: EM64L-G09RevD.01
frameworkgroup: C1[X(C23H21N7O5)]
method: RPBEPBE
basis: SDD
operation: Freq
keyword: #p
keyword: freq=noraman
keyword: PBEPBE/SDD
title: #p freq=noraman PBEPBE/SDD
converged: YES YES NO NO
title: Mulliken charges:
elementType: O O O O O N N N N N N N C C C C C C C C C C C C C C C C C C C C C C C H H H H H H H H H H H H H H H H H H H H H
charge: -0.429198 -0.310876 -0.218079 -0.434945 -0.191970 -0.411743 -0.414886 0.084371 -0.019075 -0.411280 -0.035911 -0.612616 -0.148679 -0.561763 0.536795 0.192093 0.291965 0.149290 -0.399198 -0.371674 0.480581 -0.522478 -0.359722 -0.344106 -0.378670 -0.442505 -0.394554 -0.384629 0.165344 0.280721 -0.170911 0.165121 -0.390699 0.001153 0.154247 0.292633 0.256634 0.210825 0.316327 0.227326 0.276326 0.258083 0.262314 0.209698 0.274149 0.300873 0.244706 0.222451 0.216351 0.254752 0.287067 0.388967 0.327579 0.350161 0.319435 0.361828
chargesum: 0.00000
title: Mulliken charges with hydrogens summed into heavy atoms:
elementType: O O O O O N N N N N N N C C C C C C C C C C C C C C C C C C C C C C C
charge: -0.040230 -0.310876 -0.218079 -0.084784 -0.191970 -0.095416 -0.114013 0.084371 -0.019075 -0.083701 -0.035911 0.068647 0.143954 -0.094304 0.536795 0.192093 0.291965 0.149290 -0.171872 -0.095348 0.480581 -0.002081 -0.150024 -0.069957 -0.133964 -0.220055 -0.178203 -0.129877 0.165344 0.280721 -0.170911 0.165121 -0.103632 0.001153 0.154247
polarizability: 4.00250253e+02 -3.85322837e+01 3.33134225e+02 -2.28618577e+01 -2.22901631e+00 2.75232836e+02
1716.lowfreq: -0.2300 -0.0006 -0.0003 0.0006 1.3102 4.6917 5.7626 9.1608 11.8785
frequency: 5.4255 8.9467 11.7985 18.8486 30.9653 34.9504 42.5204 44.8215 48.1332 69.4426 74.0864 88.0004 99.2979 122.6191 130.0260 147.6681 153.8112 168.4987 184.5758 197.1905 223.0398 240.8280 265.4918 283.6191 297.6423 306.0513 315.4113 319.0036 331.6220 341.9526 355.2284 364.1905 387.8029 409.6039 411.7499 419.8842 423.8844 432.2623 441.9055 449.1429 470.4607 488.2380 510.0861 514.2193 535.6215 542.9976 546.9671 551.5322 553.2356 579.3415 592.3011 601.4537 604.7791 612.3052 629.1510 636.3593 637.7002 642.3565 683.3670 684.4195 698.2459 706.6069 711.5457 714.6632 754.0970 762.2097 775.7648 796.5860 812.5977 814.2813 816.7269 820.4062 831.2237 834.0486 840.1077 883.2680 889.9303 906.0219 918.5038 931.0495 941.5433 971.1901 971.9097 983.3397 992.3010 1001.3893 1004.6598 1016.5739 1028.4207 1075.1498 1080.6808 1101.8504 1112.4121 1116.7121 1133.6346 1144.4129 1153.0837 1181.2683 1186.5180 1200.3768 1207.0401 1220.8017 1238.6847 1247.9805 1248.4093 1257.0945 1270.1815 1272.4292 1273.3630 1294.6760 1304.4203 1307.0389 1311.7444 1323.6892 1326.7506 1351.3060 1354.7211 1366.3986 1377.9546 1391.8383 1426.6704 1431.1570 1436.6127 1453.4791 1458.2160 1463.9963 1469.4970 1488.7057 1508.7636 1513.3767 1526.3348 1537.6029 1563.6394 1589.4890 1594.7698 1598.6224 1599.6577 1628.2195 1630.3994 1643.4924 1665.1647 2971.7124 2982.9887 3019.0543 3038.1713 3047.3900 3105.7134 3116.9206 3120.2750 3130.3852 3138.8086 3157.3563 3162.3851 3170.7843 3172.8416 3507.8683 3520.9755 3548.5037 3570.4566 3575.2018 3582.0775 3700.2985
redmass: 8.1976 7.5762 6.6529 6.7551 9.7758 4.8065 5.5152 5.2551 5.0350 5.3131 6.5027 6.1630 7.1049 7.1880 7.0166 5.2702 6.8015 5.6263 6.4583 5.7911 4.2121 5.3225 4.0009 4.5573 4.2067 1.1494 3.9075 4.6416 4.0913 1.1691 7.0418 3.9005 3.3722 2.7497 2.9729 4.5517 1.4593 3.7143 5.2165 5.3917 8.4516 4.1401 2.8475 3.0655 2.9004 3.4803 1.7870 2.9412 1.3867 5.3979 2.2149 3.5324 3.3364 3.2365 1.3889 6.1699 5.6560 6.9365 3.1994 4.0401 9.2239 3.2073 5.8068 6.9352 4.5227 5.0364 4.9510 1.4831 1.7786 3.3691 10.8039 5.6726 1.3906 5.7520 1.7331 2.0670 3.9076 5.1068 1.4273 1.4316 1.3907 1.3844 3.7292 1.3760 2.4316 2.4596 2.8311 2.4920 3.0796 3.2823 2.5940 3.1291 1.4963 3.6752 1.4628 1.3608 2.3106 4.0007 1.1678 1.1659 1.5986 1.6835 3.1478 1.5875 1.6526 7.1363 1.8191 1.8236 1.5644 1.6462 2.2308 2.2461 1.4072 1.5858 1.8227 1.3424 2.2598 2.6463 2.4956 4.9234 2.6314 3.4012 4.1039 2.0304 1.2243 1.8338 1.6875 1.8944 2.6546 8.7964 3.5294 4.3547 4.3244 3.0235 5.5293 2.4242 5.8822 6.3158 6.2101 2.8530 9.2454 1.0590 1.0637 1.0957 1.0881 1.0977 1.0870 1.0895 1.0885 1.0964 1.0907 1.0937 1.0949 1.0953 1.0929 1.0777 1.0642 1.0456 1.0768 1.0773 1.0660 1.1054
irintensity: 1.1886 1.8017 1.8057 6.8395 1.8719 1.9576 2.4929 0.1139 0.7941 2.2744 2.5328 7.0225 1.3339 0.2655 1.1514 0.9494 11.2310 1.3899 0.8866 9.9625 2.4083 1.8983 3.4276 4.7906 3.8079 60.4621 0.9617 3.1207 1.5366 144.3876 1.4628 4.3793 10.2448 6.8116 3.0053 9.4882 97.0871 15.5033 15.2430 2.8191 2.6437 18.2027 12.9043 35.4552 90.0465 94.6086 17.4384 41.9822 120.5472 4.8946 157.7526 20.9272 29.8729 24.3740 85.5225 6.5774 12.7724 1.1348 42.8944 39.4920 18.6199 2.0432 0.4837 1.2809 27.5668 1.3813 4.3931 34.3025 2.9042 19.4990 7.1158 17.2825 27.7609 9.3511 54.9213 36.2852 53.4195 8.3260 9.7451 3.4762 1.0977 2.7464 5.1962 3.1755 6.7813 2.1337 4.6276 56.8622 1.9203 39.0138 162.6355 14.2996 64.3341 33.4741 34.6068 173.7063 27.7495 49.5163 14.0210 94.3493 24.4008 11.4906 2.0057 27.2828 18.2906 16.9533 27.3939 70.5859 82.6701 74.8187 111.0842 45.4998 4.3181 22.3927 146.5359 22.0061 29.4971 354.0970 35.7585 18.8762 19.5370 7.5130 127.0203 132.7015 79.9528 28.6052 27.1945 405.1601 104.3861 87.8481 158.8912 56.9167 49.6712 413.1531 126.9897 260.9802 14.8477 28.3703 390.0003 451.5058 259.2813 25.1480 23.0099 11.4109 23.6962 6.8067 17.3014 24.1493 14.0307 19.9255 2.4241 17.3633 4.7904 4.4396 6.6880 32.4227 33.2802 154.2572 21.2127 48.9787 33.2708 49.0440
temp: 298.150 k
press: 1.00000 atm
elementType: 8 8 8 8 8 7 7 7 7 7 7 7 6 6 6 6 6 6 6 6 6 6 6 6 6 6 6 6 6 6 6 6 6 6 6 1 1 1 1 1 1 1 1 1 1 1 1 1 1 1 1 1 1 1 1 1
symmnumber: 1
zpe: 1103248.2 jmol-1
zpe.correction: 0.420205 hartree
zpe.thermalcorrener: 0.451758 hartree
zpe.thermalcorrenthalpy: 0.452702 hartree
zpe.thermalcorrgfe: 0.350508 hartree
zpe.sumelectzpe: -1645.984596 hartree
zpe.sumelectthermal: -1645.953043 hartree
zpe.sumelectthermalent: -1645.952099 hartree
zpe.sumelectthermalfe: -1646.054293 hartree
dipole: -3.7574 5.3826 -1.1384
dipole: 6.6624
quadrupole: -250.8598 -157.6147 -203.7507
quadrupole: -36.0415 53.5874 14.9713
quadrupole: -46.7847 46.4603 0.3244 -36.0415 53.5874 14.9713
hfenergy: -1646.4048007 hartree
pointgroup: C01 [X(C23H21N7O5)]
dipole: 1.4657581 2.1489675 0.3225989 debye
polarizability: 398.0805585|38.2250477|333.9891569|-27.7027053|-1.392893|276.5475992 unknown
InChI: InChI=1S/C23H21N7O5/c24-23-29-19-18(21(33)30-23)27-15(11-26-19)10-25-14-5-3-13(4-6-14)20(32)28-17(22(34)35)9-12-1-7-16(31)8-2-12/h1-8,11,17,25,28-29,31,34H,9-10,24H2
charge 0 multiplicity 1
56 atoms
O  -4.945955 -2.515087 -2.454378
O  -4.151197 -1.339744 1.775009
O  -7.112468 -1.958015 -1.826303
O  -3.64668 5.204378 1.649235
O  6.914933 -0.92947 -2.489571
N  -3.810513 -1.081603 -0.510726
N  2.143232 -2.857021 1.583772
N  4.83596 -1.335071 -0.52449
N  4.135393 0.917782 1.074009
N  5.776034 2.187162 -0.044365
N  7.164549 1.295923 -1.80621
N  7.406416 3.513852 -1.127719
C  -5.215872 -0.777665 -0.76657
C  -5.460488 0.637358 -1.38573
C  -4.923746 1.808607 -0.570718
C  -3.358366 -1.37247 0.774397
C  -1.913279 -1.728742 0.919184
C  -5.882343 -1.799366 -1.69036
C  -4.53603 2.992309 -1.246358
C  -4.856974 1.79641 0.848072
C  0.820115 -2.473031 1.34829
C  3.212378 -2.788033 0.593413
C  -0.927013 -1.490511 -0.072711
C  -1.501652 -2.326165 2.141999
C  0.418982 -1.848199 0.129998
C  -0.16849 -2.697271 2.355214
C  -4.109329 4.138787 -0.541478
C  -4.430309 2.931125 1.566239
C  3.864284 -1.414853 0.430211
C  -4.060882 4.104831 0.872123
C  5.474324 -0.143788 -0.692693
C  5.111629 0.9719 0.125011
C  3.512862 -0.284735 1.219728
C  6.562834 0.013235 -1.734515
C  6.784598 2.290876 -1.012016
H  -5.728903 -0.845488 0.210512
H  -6.557009 0.737825 -1.515693
H  -5.020552 0.664423 -2.402476
H  -3.21448 -1.273608 -1.316035
H  -4.57162 3.025318 -2.342573
H  -5.114443 0.892274 1.410648
H  2.854139 -3.119544 -0.401421
H  4.007825 -3.502463 0.874073
H  -1.185064 -0.981922 -1.009671
H  -2.26185 -2.488106 2.913096
H  2.344299 -3.318981 2.469557
H  1.153956 -1.629626 -0.650689
H  0.123102 -3.168645 3.302376
H  -3.817045 5.044901 -1.08877
H  -4.372547 2.919791 2.658504
H  2.722253 -0.345686 1.971496
H  -5.425187 -3.145908 -3.056867
H  5.485283 2.962689 0.557982
H  -3.424448 5.976128 1.07152
H  7.178279 4.32165 -0.554236
H  8.136877 3.580888 -1.833427
