program: Gaussian 09
title: 000017258
version: EM64L-G09RevD.01
frameworkgroup: C1[X(C11H20O2)]
method: RPBEPBE
basis: SDD
operation: Freq
keyword: #pfreq=noraman
keyword: PBEPBE/SDD
title: #p freq=noraman PBEPBE/SDD
converged: NO YES NO NO
title: Mulliken charges:
elementType: O O C C C C C C C C C C C H H H H H H H H H H H H H H H H H H H H
charge: -0.272632 -0.251036 -0.376797 -0.371398 -0.377835 -0.352454 -0.392366 -0.356584 -0.290520 -0.695668 0.253683 -0.210875 -0.476428 0.194207 0.194289 0.190402 0.190323 0.194921 0.195038 0.188244 0.188306 0.213082 0.213038 0.195284 0.195284 0.228212 0.228273 0.209801 0.209798 0.215837 0.251739 0.227788 0.247046
chargesum: 0.00000
title: Mulliken charges with hydrogens summed into heavy atoms:
elementType: O O C C C C C C C C C C C
charge: -0.272632 -0.251036 0.011699 0.009327 0.012123 0.024096 0.033754 0.033984 0.165964 -0.060232 0.253683 0.040864 -0.001594
polarizability: 1.91435265e+02 1.20338955e+00 1.10757770e+02 3.99287401e-02 1.87177360e-03 8.77963111e+01
1716.lowfreq: -3.9211 -0.0005 0.0003 0.0009 6.7102 22.5155 24.1260 35.5476 51.1973
frequency: 22.3277 35.5465 49.0224 53.4075 88.9229 96.0117 98.1368 117.3652 142.3098 150.5211 177.0641 180.1711 208.3393 224.9615 261.7889 319.2328 353.8579 424.0041 474.5564 508.1646 515.1089 649.8050 724.2867 731.6208 753.5484 780.0214 795.0131 841.4618 860.7705 887.8934 934.9463 939.6755 993.6414 995.2772 1007.2319 1012.5296 1023.4918 1047.7653 1062.4095 1078.3908 1080.6121 1087.9846 1125.8439 1134.7642 1151.0336 1188.9374 1222.0424 1223.9777 1259.2047 1264.4972 1278.7293 1285.2029 1288.2178 1296.9146 1299.2541 1304.0831 1337.1598 1354.8293 1358.0116 1372.5955 1389.1255 1410.8336 1463.2170 1464.2501 1468.2573 1469.9517 1475.5219 1476.2925 1481.6374 1488.0118 1491.5179 1620.1254 1642.5389 2952.6283 2954.5784 2957.8296 2964.9319 2970.3908 2972.7890 2987.2350 2990.7187 2995.3466 2999.2724 3007.6069 3023.8983 3038.1193 3046.4660 3069.2094 3072.0095 3073.6100 3103.7467 3157.7227 3219.7914
redmass: 4.3978 4.0892 2.5694 2.6716 1.7180 3.9935 2.9522 2.0017 2.0409 2.0152 4.2220 4.3770 2.6859 1.1377 3.4451 3.9434 3.7250 3.2480 3.1809 1.7650 4.0408 3.8228 1.0617 1.0796 1.1068 3.2082 1.1824 4.6720 1.2088 1.9184 6.6627 1.1988 1.4032 4.5482 1.0777 1.1148 3.6401 3.0633 1.6313 2.4491 2.2837 2.3427 2.9889 4.1474 1.4451 1.6590 1.2833 1.3837 1.2469 1.2926 1.1098 1.0578 1.4214 1.1192 1.0937 1.3391 1.4061 1.5948 1.6171 1.5392 1.2173 1.2300 1.0715 1.0737 1.0692 1.0781 1.0752 1.0423 1.0806 1.0897 1.0978 11.3025 4.5782 1.0588 1.0587 1.0592 1.0592 1.0587 1.0365 1.0967 1.0597 1.0991 1.0566 1.1020 1.1040 1.1042 1.1048 1.1007 1.0993 1.1074 1.0598 1.0957 1.1157
irintensity: 0.1493 0.2129 0.4134 0.8117 1.2396 0.8450 0.7060 1.1458 0.0006 0.0000 0.8077 2.5232 5.3259 0.0073 1.3246 10.5901 2.8692 3.1919 1.6311 0.0479 1.1454 2.2499 14.2604 0.2654 5.3670 22.6268 1.2791 11.6351 0.3597 3.3337 39.7187 0.9600 39.9587 2.7751 46.4095 0.5710 4.8260 0.7235 16.0009 0.4641 11.8019 58.5575 2.1257 450.6049 1.2239 0.0017 8.2421 0.1018 0.0329 0.1897 0.4571 0.5216 40.5414 0.0942 0.0976 1.9687 0.1247 2.6866 0.5776 13.4937 11.7677 69.7930 0.0210 0.0439 0.3456 0.1016 2.3200 12.4766 1.0327 2.1905 32.4484 149.3015 19.3123 0.3250 1.3891 0.2746 18.6707 151.9496 36.2810 0.0417 12.2395 0.4662 47.4547 1.2931 0.0320 65.4670 50.8756 86.1679 54.4891 98.7138 4.9539 4.3810 8.6398
temp: 298.150 k
press: 1.00000 atm
elementType: 8 8 6 6 6 6 6 6 6 6 6 6 6 1 1 1 1 1 1 1 1 1 1 1 1 1 1 1 1 1 1 1 1
symmnumber: 1
zpe: 756241.3 jmol-1
zpe.correction: 0.288037 hartree
zpe.thermalcorrener: 0.304486 hartree
zpe.thermalcorrenthalpy: 0.305431 hartree
zpe.thermalcorrgfe: 0.241631 hartree
zpe.sumelectzpe: -580.543481 hartree
zpe.sumelectthermal: -580.527032 hartree
zpe.sumelectthermalent: -580.526088 hartree
zpe.sumelectthermalfe: -580.589887 hartree
dipole: 1.0355 -1.5319 -0.0012
dipole: 1.8490
quadrupole: -77.3815 -84.5244 -81.0727
quadrupole: 10.7030 0.0197 0.0103
quadrupole: 3.6114 -3.5315 -0.0798 10.7030 0.0197 0.0103
hfenergy: -580.8315184 hartree
pointgroup: C01 [X(C11H20O2)]
dipole: 0.407398 0.6026222 0.0093671 debye
polarizability: 191.4344996|-1.2001793|110.7515648|-0.2959342|0.3787527|87.8032811 unknown
InChI: InChI=1S/C11H20O2/c1-3-5-6-7-8-9-10-13-11(12)4-2/h4H,2-3,5-10H2,1H3
charge 0 multiplicity 1
33 atoms
O  -2.832159 0.444963 0.012975
O  -4.252804 -1.412933 -0.012843
C  2.172448 0.393292 -0.001866
C  3.466671 -0.450774 -0.014785
C  0.88638 -0.463381 -0.01168
C  4.753041 0.405492 -0.00553
C  -0.401434 0.39316 0.004045
C  6.04928 -0.436703 -0.016924
C  -1.658742 -0.475799 -0.005223
C  7.328576 0.427666 -0.006815
C  -4.09235 -0.166669 0.007519
C  -5.156943 0.870319 0.028334
C  -6.47146 0.52973 0.026935
H  2.170284 1.047383 0.894856
H  2.167813 1.070965 -0.880851
H  3.469091 -1.105501 -0.911352
H  3.471623 -1.128616 0.864454
H  0.893159 -1.142008 0.866608
H  0.889182 -1.115612 -0.909753
H  4.751808 1.061448 0.890289
H  4.750263 1.082726 -0.88533
H  -0.417043 1.064857 -0.875744
H  -0.41207 1.039092 0.90301
H  6.051117 -1.113634 0.861826
H  6.050012 -1.091253 -0.912487
H  -1.718677 -1.137244 0.879481
H  -1.724433 -1.109676 -0.909488
H  7.366145 1.068309 0.894549
H  7.364201 1.092095 -0.890855
H  8.240866 -0.196704 -0.016131
H  -4.819656 1.911862 0.044819
H  -7.2607 1.288318 0.042461
H  -6.769087 -0.52537 0.010094
