program: Gaussian 09
title: 000195863
version: EM64L-G09RevD.01
frameworkgroup: C1[X(C12H23NO10)]
method: RPBEPBE
basis: SDD
operation: Freq
keyword: #p
keyword: freq=noraman
keyword: PBEPBE/SDD
title: #p freq=noraman PBEPBE/SDD
converged: NO YES NO NO
title: Mulliken charges:
elementType: O O O O O O O O O O N C C C C C C C C C C C C H H H H H H H H H H H H H H H H H H H H H H H
charge: -0.279604 -0.283854 -0.513693 -0.448649 -0.418715 -0.441593 -0.426357 -0.467564 -0.469610 -0.473876 -0.608579 0.005866 -0.190614 -0.154172 -0.157373 -0.281584 -0.094735 -0.042575 -0.270244 -0.128740 -0.111661 -0.002442 -0.406710 0.221787 0.242940 0.239222 0.255773 0.280969 0.220182 0.214672 0.265284 0.242321 0.219693 0.268048 0.216032 0.270398 0.319981 0.285021 0.404913 0.357952 0.340878 0.339931 0.348864 0.366695 0.368950 0.376572
chargesum: 0.00000
title: Mulliken charges with hydrogens summed into heavy atoms:
elementType: O O O O O O O O O O N C C C C C C C C C C C C
charge: -0.279604 -0.283854 -0.108780 -0.090696 -0.077837 -0.101662 -0.077493 -0.100869 -0.100660 -0.097304 -0.003577 0.227653 0.052326 0.085050 0.098401 -0.000615 0.125447 0.172097 -0.004961 0.113581 0.108032 0.265607 0.079720
polarizability: 1.96840264e+02 1.26062127e+00 1.72064553e+02 2.52666416e+00 2.54806174e+00 1.38361992e+02
1716.lowfreq: -7.0265 0.0002 0.0007 0.0008 2.9077 11.8238 36.5262 41.3286 53.4709
frequency: 36.0642 41.2440 53.4511 71.1678 77.8901 103.3603 108.9475 125.1134 126.1731 145.4543 175.9987 197.9244 209.7747 220.4567 231.8109 236.4406 244.6227 262.3476 272.2612 284.4980 301.7544 325.1180 339.7665 347.2737 357.3362 382.0493 385.0701 397.6818 402.2895 420.7457 430.7397 434.4983 436.8207 440.9368 474.4973 494.6414 510.0260 517.9052 527.6044 556.8623 570.0990 581.1372 593.2712 632.4447 684.1753 710.2990 727.1000 772.2035 799.2448 825.6163 848.7706 866.1054 904.4206 911.6333 921.8122 938.7253 968.7918 973.4644 981.3675 1000.5125 1006.5624 1014.4516 1023.4719 1034.7476 1059.4133 1060.7713 1068.8962 1071.7001 1076.2404 1092.2437 1104.3291 1113.1933 1118.0918 1138.1036 1157.1653 1166.3362 1183.3837 1193.5633 1217.3125 1224.1760 1234.6977 1237.9953 1242.2946 1260.5297 1262.4091 1271.1351 1291.0202 1295.5095 1297.0019 1299.9419 1307.8717 1319.8239 1324.7133 1333.9322 1337.3263 1341.3775 1344.2071 1352.5355 1365.4724 1379.4847 1379.8256 1384.7691 1393.3139 1404.2014 1407.1954 1411.5710 1437.2245 1462.6617 1643.0904 2934.8658 2941.6807 2958.7181 2964.6618 2973.6515 3003.5965 3008.0601 3011.1366 3022.3969 3034.0585 3050.1260 3057.4316 3126.3337 3151.5397 3430.7034 3443.4959 3471.5447 3514.7057 3520.6079 3523.3140 3547.9247 3567.1149 3583.0677
redmass: 5.4211 6.3483 7.1030 6.7194 3.9228 5.5078 6.3974 4.7084 4.9551 5.5547 4.8987 5.6233 3.9853 4.3733 4.3084 4.4181 4.2399 5.0568 6.0602 4.7620 4.7814 3.8900 5.2106 1.3128 1.7980 2.4474 2.7190 3.5294 3.0494 4.1131 2.0838 1.3121 1.8314 1.3916 2.4182 1.4845 1.4046 5.9086 2.5301 2.9360 3.0801 1.2729 3.0702 3.8650 3.8404 4.7452 2.8044 1.8488 2.6588 1.4304 2.6945 2.7524 3.1874 4.2386 5.6881 4.5733 6.4638 2.9252 3.7497 2.9242 3.3102 4.1728 2.8196 3.7844 2.4731 2.7756 3.3217 2.8854 3.9276 3.0398 2.5231 2.2239 1.7286 2.8193 1.5942 1.2265 1.5218 1.5700 1.4295 1.3208 1.2459 1.3721 1.3057 1.3380 1.1613 1.2722 1.2670 1.2252 1.2005 1.2123 1.2183 1.2541 1.2092 1.3991 1.3455 1.3100 1.2721 1.2076 1.3553 1.2325 1.3475 1.5669 1.1594 1.6375 1.7056 1.6136 1.2136 1.0811 1.0914 1.0821 1.0814 1.0817 1.0836 1.0852 1.0866 1.0777 1.0855 1.0721 1.0857 1.0850 1.0853 1.1006 1.0714 1.0479 1.0634 1.0641 1.0656 1.0654 1.0652 1.0658 1.0958 1.0658
irintensity: 0.6852 1.9136 2.1943 2.0368 13.6801 3.6692 3.0174 7.0160 0.8238 3.9671 4.1792 16.9181 4.0545 4.8440 40.1548 4.2865 11.2013 28.2679 24.0900 13.6662 3.0602 13.3831 7.7729 18.7036 16.7155 3.3379 7.5835 6.3856 24.4686 9.3405 17.0894 311.3139 20.5933 127.6486 18.6685 118.5364 200.7048 4.1708 137.5942 24.6254 64.5205 113.4704 6.8583 8.1962 68.7262 34.1142 39.6285 253.9695 30.9308 14.0062 44.1211 28.9808 82.0317 13.0574 174.9963 146.2314 23.0831 40.8254 96.5652 137.7259 14.5110 27.4297 40.6171 34.7515 29.4936 169.0519 37.1126 43.5058 14.4609 65.6917 14.5329 28.7903 49.1062 5.5894 5.1735 80.4233 8.8445 26.2717 16.8220 4.6354 12.5540 59.1185 21.7525 1.6375 6.1802 21.5348 11.9425 17.7021 53.2342 5.2942 36.4483 11.7485 8.2080 7.2929 4.6862 7.9539 3.5065 23.6987 15.3253 47.6313 4.4680 10.5905 14.6967 3.5393 8.0621 4.5684 31.2161 5.4567 37.0110 26.4533 12.5788 7.4484 39.7802 49.3195 31.0467 13.1881 21.1444 51.9261 42.8762 1.8465 37.1091 6.3927 770.5898 16.2256 34.4871 10.9430 12.9042 2.2751 16.0201 22.0841 15.6352 19.8259
temp: 298.150 k
press: 1.00000 atm
elementType: 8 8 8 8 8 8 8 8 8 8 7 6 6 6 6 6 6 6 6 6 6 6 6 1 1 1 1 1 1 1 1 1 1 1 1 1 1 1 1 1 1 1 1 1 1 1
symmnumber: 1
zpe: 974405.2 jmol-1
zpe.correction: 0.371131 hartree
zpe.thermalcorrener: 0.395009 hartree
zpe.thermalcorrenthalpy: 0.395954 hartree
zpe.thermalcorrgfe: 0.319650 hartree
zpe.sumelectzpe: -1276.139352 hartree
zpe.sumelectthermal: -1276.115474 hartree
zpe.sumelectthermalent: -1276.114530 hartree
zpe.sumelectthermalfe: -1276.190833 hartree
dipole: 1.9756 -2.5553 -1.2641
dipole: 3.4684
quadrupole: -157.4494 -139.9751 -127.2679
quadrupole: 12.0410 -17.4275 0.5468
quadrupole: -15.8853 1.5891 14.2962 12.0410 -17.4275 0.5468
hfenergy: -1276.5104836 hartree
pointgroup: C01 [X(C12H23N1O10)]
dipole: 0.7226611 -1.0273885 -0.533239 debye
polarizability: 197.0024056|0.332874|171.9234081|0.9812492|2.940071|138.3409953 unknown
InChI: InChI=1S/C12H23NO10/c13-3-5(16)4(15)2(1-14)22-12(3)23-11-9(20)7(18)6(17)8(19)10(11)21/h2-12,14-21H,1,13H2
charge 0 multiplicity 1
46 atoms
O  0.359661 -0.909495 -0.265819
O  1.707652 0.885949 -1.157918
O  -0.992273 1.524491 0.791597
O  -1.605566 -2.811123 0.310048
O  -3.114721 2.634838 -0.55024
O  -4.10623 -1.82299 1.432891
O  -5.132544 0.577218 0.110594
O  4.50935 -1.862669 0.334726
O  4.207924 0.735006 1.609283
O  1.041979 3.277058 0.167232
N  2.244443 -2.894307 -1.075127
C  -1.054797 -0.599342 -0.528034
C  -1.378748 0.916654 -0.486693
C  -1.848078 -1.379485 0.522811
C  -2.901895 1.195324 -0.644254
C  -3.350766 -1.082486 0.386605
C  -3.71086 0.413505 0.413614
C  1.313455 -0.528448 -1.281346
C  2.546915 -1.451953 -1.090207
C  3.265827 -1.099935 0.235958
C  3.612733 0.391134 0.315703
C  2.295019 1.171372 0.183229
C  2.403077 2.686402 0.282834
H  -1.324961 -0.984208 -1.53793
H  -0.853922 1.414637 -1.324749
H  -1.493146 -1.065488 1.529524
H  -3.265381 0.9127 -1.648368
H  -3.732985 -1.532138 -0.548076
H  -3.467188 0.825641 1.420485
H  0.881528 -0.603165 -2.298815
H  3.249113 -1.24402 -1.919501
H  2.594861 -1.352964 1.085487
H  4.306171 0.647744 -0.514777
H  1.590109 0.810645 0.957926
H  3.062002 3.102205 -0.502481
H  2.786246 2.971142 1.273251
H  1.403525 -3.105357 -0.519928
H  2.217402 -3.3367 -1.998658
H  -0.208443 2.151577 0.659927
H  -2.299109 -3.299866 0.827718
H  -2.643774 2.914734 0.282897
H  -3.841425 -1.464917 2.321974
H  -5.630367 -0.079322 0.666114
H  4.258042 -2.792418 0.070514
H  4.900363 0.050842 1.80233
H  0.836281 3.387679 -0.79485
